CAS Reg. No. 137165-38-9
- CAS Registry Number: 137165-38-9

Reaction thermochemistry data

Data compiled by: John E. Bartmess
Individual Reactions
(CAS Reg. No. 137165-38-9 • 4294967295) +
= CAS Reg. No. 137165-38-9
By formula: (CAS Reg. No. 137165-38-9 • 4294967295Pd) + Pd = CAS Reg. No. 137165-38-9
Quantity | Value | Units | Method | Reference | Comment |
---|---|---|---|---|---|
ΔrH° | 208. ± 16. | kJ/mol | N/A | Ho, Ervin, et al., 1991 | gas phase; Singlet state 0.497±0.008 eV up |

References

Ho, Ervin, et al., 1991
Ho, J.; Ervin, K.M.; Polak, M.L.; Gilles, M.K.; Lineberger, W.C.,
A Study of the Electronic Structures of Pd2- and Pd2 by Photoelectron Spectroscopy,
J. Chem. Phys., 1991, 95, 7, 4845, https://doi.org/10.1063/1.461702
. [all data]