yttrium trifluoride

Reaction thermochemistry data

Data compiled by: John E. Bartmess

Individual Reactions

Fluorine anion + F3Y = (Fluorine anion • F3Y)

By formula: F- + F3Y = (F- • F3Y)

Quantity Value Units Method Reference Comment
Δr477. ± 21.kJ/molTDEqPyatenko, Gusarov, et al., 1981gas phase; F-A at 0 K; ΔHf at 298 K. Equilibrium measured vs. AlF4-; value altered from reference due to conversion from electron convention to ion convention

F4Y- + F3Y = F7Y2-

By formula: F4Y- + F3Y = F7Y2-

Quantity Value Units Method Reference Comment
Δr234. ± 21.kJ/molTDAsPyatenko, Gusarov, et al., 1981gas phase; ΔHf at 298K, fluoride affinity at 0K; value altered from reference due to conversion from electron convention to ion convention

Vibrational and/or electronic energy levels

Data compiled by: Marilyn E. Jacox

State:   X

Vib.
sym.
 No.   Approximate
 type of mode
 cm-1   Med.   Method   References

e' 3 Asym. stretch 561.0 Ar IR Wang and Andrews, 2010

References

Pyatenko, Gusarov, et al., 1981
Pyatenko, A.T.; Gusarov, A.V.; Gorokhov, L.N., Negative Ions in Vapor over Yttrium Trifluoride, High Temp., 1981, 19, 1167. [all data]