xenon difluoride
- Formula: F2Xe
- Molecular weight: 169.290
- CAS Registry Number: 13709-36-9

Phase change data

Data compiled as indicated in comments:
TRC - Thermodynamics Research Center, NIST Boulder Laboratories, Chris Muzny director
AC - William E. Acree, Jr., James S. Chickos
Quantity | Value | Units | Method | Reference | Comment |
---|---|---|---|---|---|
Ttriple | 402.5 | K | N/A | Ogrin, Zemva, et al., 1972 | Uncertainty assigned by TRC = 0.4 K; TRC |
Quantity | Value | Units | Method | Reference | Comment |
Tc | 631. | K | N/A | Ogrin, Zemva, et al., 1972 | Uncertainty assigned by TRC = 3. K; TRC |
Enthalpy of vaporization
ΔvapH (kcal/mol) | Temperature (K) | Reference | Comment |
---|---|---|---|
12.8 | 568. | House, 1983 | Based on data from 553. to 663. K.; AC |

Ion clustering data

Data compiled by: John E. Bartmess
Clustering reactions
+ F2Xe = F3Xe-
Quantity | Value | Units | Method | Reference | Comment |
---|---|---|---|---|---|
ΔrH° | 138.43 | kcal/mol | N/A | Krouse, Hao, et al., 2007 | gas phase |

Reaction thermochemistry data

Data compiled by: John E. Bartmess

Individual Reactions

Fluorine anion + F2Xe = F3Xe-

By formula: F- + F2Xe = F3Xe-

Quantity Value Units Method Reference Comment
Δr579.19kJ/molN/AKrouse, Hao, et al., 2007gas phase

References

Ogrin, Zemva, et al., 1972
Ogrin, T.; Zemva, B.; Bohinc, M.; slivnik, J.,
Critical constants and liquid densities of xenon difluoride and xenon tetrafluoride,
J. Chem. Eng. Data, 1972, 17, 418-9. [all data]
House, 1983
House, J.E.,
Cohesion energies and solubility parameters for xenon difluoride and xenon tetrafluoride,
Journal of Fluorine Chemistry, 1983, 22, 3, 299-303, https://doi.org/10.1016/S0022-1139(00)84959-3
. [all data]
Krouse, Hao, et al., 2007
Krouse, I.H.; Hao, C.T.; Check, C.E.; Lobring, K.C.; Sunderlin, L.S.; Wenthold, P.G.,
Bonding and electronic structure of XeF3-,
J. Am. Chem. Soc., 2007, 129, 4, 846-852, https://doi.org/10.1021/ja065038b
. [all data]