Trifluoroboroxine
- Formula: B3F3O3
- Molecular weight: 137.426
- IUPAC Standard InChIKey: FVWCXYPJHTZDEU-UHFFFAOYSA-N
- CAS Registry Number: 13703-95-2
- Chemical structure:
View 3d structure (requires JavaScript / HTML 5) - Permanent link for this species. Use this link for bookmarking this species for future reference.

Gas phase thermochemistry data

Quantity | Value | Units | Method | Reference | Comment |
---|---|---|---|---|---|
ΔfH°gas | -2365.22 | kJ/mol | Review | Chase, 1998 | Data last reviewed in March, 1965 |
Quantity | Value | Units | Method | Reference | Comment |
S°gas,1 bar | 342.44 | J/mol*K | Review | Chase, 1998 | Data last reviewed in March, 1965 |
Gas Phase Heat Capacity (Shomate Equation)
Cp° = A + B*t + C*t2 + D*t3 +
E/t2
H° − H°298.15= A*t + B*t2/2 +
C*t3/3 + D*t4/4 − E/t + F − H
S° = A*ln(t) + B*t + C*t2/2 + D*t3/3 −
E/(2*t2) + G
Cp = heat capacity (J/mol*K)
H° = standard enthalpy (kJ/mol)
S° = standard entropy (J/mol*K)
t = temperature (K) / 1000.
View plot Requires a JavaScript / HTML 5 canvas capable browser.
Temperature (K) | 298. to 1100. | 1100. to 6000. |
---|---|---|
A | 33.98308 | 204.1085 |
B | 367.5761 | 2.088942 |
C | -306.1048 | -0.421567 |
D | 92.73920 | 0.029132 |
E | -0.341760 | -18.13019 |
F | -2390.315 | -2474.192 |
G | 284.8404 | 519.5064 |
H | -2365.219 | -2365.219 |
Reference | Chase, 1998 | Chase, 1998 |
Comment | Data last reviewed in March, 1965 | Data last reviewed in March, 1965 |

Condensed phase thermochemistry data

Quantity Value Units Method Reference Comment
Δfsolid-586.501kcal/molReviewChase, 1998Data last reviewed in March, 1965
Quantity Value Units Method Reference Comment
solid51.998cal/mol*KReviewChase, 1998Data last reviewed in March, 1965

Solid Phase Heat Capacity (Shomate Equation)

Cp° = A + B*t + C*t2 + D*t3 + E/t2
H° − H°298.15= A*t + B*t2/2 + C*t3/3 + D*t4/4 − E/t + F − H
S° = A*ln(t) + B*t + C*t2/2 + D*t3/3 − E/(2*t2) + G
    Cp = heat capacity (cal/mol*K)
    H° = standard enthalpy (kcal/mol)
    S° = standard entropy (cal/mol*K)
    t = temperature (K) / 1000.

View plot Requires a JavaScript / HTML 5 canvas capable browser.

View table.

Temperature (K) 298. - 1500.
A 9.050070
B 76.43769
C -38.22940
D 5.703691
E 0.124669
F -591.8521
G 42.51090
H -586.5010
ReferenceChase, 1998
Comment Data last reviewed in March, 1965

Gas phase ion energetics data

Data compiled as indicated in comments:
RDSH - Henry M. Rosenstock, Keith Draxl, Bruce W. Steiner, and John T. Herron

Ionization energy determinations

IE (eV) Method Reference Comment
13.9 ± 0.1EIBidinosti and Coatsworth, 1970RDSH

Appearance energy determinations

Ion AE (eV) Other Products MethodReferenceComment
B2O2F2+16.6 ± 0.2?EIBidinosti and Coatsworth, 1970RDSH
B2OF3+15.4 ± 0.2BO2EIBidinosti and Coatsworth, 1970RDSH
B3O3F2+16.FEIBidinosti and Coatsworth, 1970RDSH

References

Chase, 1998
Chase, M.W., Jr.,
NIST-JANAF Themochemical Tables, Fourth Edition,
J. Phys. Chem. Ref. Data, Monograph 9, 1998, 1-1951. [all data]