Tungsten bromide

Condensed phase thermochemistry data

Quantity Value Units Method Reference Comment
Δfsolid-343.09kJ/molReviewChase, 1998Data last reviewed in June, 1967
Quantity Value Units Method Reference Comment
solid313.80J/mol*KReviewChase, 1998Data last reviewed in June, 1967

Solid Phase Heat Capacity (Shomate Equation)

Cp° = A + B*t + C*t2 + D*t3 + E/t2
H° − H°298.15= A*t + B*t2/2 + C*t3/3 + D*t4/4 − E/t + F − H
S° = A*ln(t) + B*t + C*t2/2 + D*t3/3 − E/(2*t2) + G
    Cp = heat capacity (J/mol*K)
    H° = standard enthalpy (kJ/mol)
    S° = standard entropy (J/mol*K)
    t = temperature (K) / 1000.

View plot Requires a JavaScript / HTML 5 canvas capable browser.

View table.

Temperature (K) 298. - 1000.
A 148.9554
B 108.7568
C 0.046450
D -0.024228
E 0.000043
F -392.3333
G 461.6333
H -343.0884
ReferenceChase, 1998
Comment Data last reviewed in June, 1967

Gas phase thermochemistry data

Quantity Value Units Method Reference Comment
Δfgas-243.09kJ/molReviewChase, 1998Data last reviewed in June, 1967
Quantity Value Units Method Reference Comment
gas,1 bar482.70J/mol*KReviewChase, 1998Data last reviewed in June, 1967

Gas Phase Heat Capacity (Shomate Equation)

Cp° = A + B*t + C*t2 + D*t3 + E/t2
H° − H°298.15= A*t + B*t2/2 + C*t3/3 + D*t4/4 − E/t + F − H
S° = A*ln(t) + B*t + C*t2/2 + D*t3/3 − E/(2*t2) + G
    Cp = heat capacity (J/mol*K)
    H° = standard enthalpy (kJ/mol)
    S° = standard entropy (J/mol*K)
    t = temperature (K) / 1000.

View plot Requires a JavaScript / HTML 5 canvas capable browser.

View table.

Temperature (K) 298. - 6000.
A 157.8297
B 0.123589
C -0.033587
D 0.002872
E -0.579681
F -292.0968
G 670.3981
H -243.0904
ReferenceChase, 1998
Comment Data last reviewed in June, 1967

References

Chase, 1998
Chase, M.W., Jr., NIST-JANAF Themochemical Tables, Fourth Edition, J. Phys. Chem. Ref. Data, Monograph 9, 1998, 1-1951. [all data]