RuF6

Gas phase ion energetics data

Data compiled by: John E. Bartmess

Electron affinity determinations

EA (eV) Method Reference Comment
6.47 ± 0.31TDEqKorobov, Kuznetsov, et al., 1989Ru2F10 + 2FeF4- <=> 2FeF3 + RuF6-, ΔH = 45.9±3.5 kcal/mol, Fluoride affinity(FeF3)=107
6.47 ± 0.31R-AKuznetsov, Korobov, et al., 1989RuF4- + RuF6- <=> 2 RuF5-: H = 7.0±2.7 kcal/mol

References

Korobov, Kuznetsov, et al., 1989
Korobov, M.V.; Kuznetsov, S.V.; Sidorov, L.N.; Shipachev, V.A.; Mit'kin, V.N., Gas Phase Negative Ions of Platinum Metal Fluorides. II. Electron Affinity of Platinum Metal Hexafluorides, Int. J. Mass Spectrom. Ion Proc., 1989, 87, 1, 13, https://doi.org/10.1016/0168-1176(89)80002-3 . [all data]

Kuznetsov, Korobov, et al., 1989
Kuznetsov, S.V.; Korobov, M.V.; Sidorov, L.N., Gas-Phase Negative Ion Chemistry of Platinum Metal Fluorides. III. Negative Ions of Pentafluorides., Int. J. Mass Spectrom. Ion Proc., 1989, 91, 3, 283, https://doi.org/10.1016/0168-1176(89)80083-7 . [all data]