1,10-Undecadiene
- Formula: C11H20
- Molecular weight: 152.2765
- IUPAC Standard InChIKey: VOSLXTGMYNYCPW-UHFFFAOYSA-N
- CAS Registry Number: 13688-67-0
- Chemical structure:
View 3d structure (requires JavaScript / HTML 5) - Other names: Undecadiene, 1,10-

Phase change data

Data compiled by: Thermodynamics Research Center, NIST Boulder Laboratories, Chris Muzny director
Quantity | Value | Units | Method | Reference | Comment |
---|---|---|---|---|---|
Tboil | 462.0 | K | N/A | Gibbons, 1941 | Uncertainty assigned by TRC = 2. K |

Kovats' RI, non-polar column, isothermal

Column type | Active phase | Temperature (C) | I | Reference | Comment |
---|---|---|---|---|---|
Packed | SE-30 | 175. | 1067. | Casteignau and Villessot, 1968 | Column length: 3. m |
Packed | SE-30 | 150. | 1088. | Casteignau and Villessot, 1968, 2 | Column length: 3. m |
Packed | SE-30 | 175. | 1067. | Casteignau and Villessot, 1968, 2 | Column length: 3. m |

Kovats' RI, polar column, isothermal

Column type | Active phase | Temperature (C) | I | Reference | Comment |
---|---|---|---|---|---|
Packed | Carbowax 20M | 175. | 1250. | Casteignau and Villessot, 1968 | Column length: 3. m |

Normal alkane RI, non-polar column, temperature ramp

Column type | Active phase | I | Reference | Comment |
---|---|---|---|---|
Capillary | Ultra-ALLOY-5 | 1083. | Tsuge, Ohtan, et al., 2011 | 30. m/0.25 mm/0.25 μm, 40. C @ 2. min, 20. K/min, 320. C @ 13. min |
Capillary | Ultra-ALLOY-5 | 1085. | Tsuge, Ohtan, et al., 2011 | 30. m/0.25 mm/0.25 μm, 40. C @ 2. min, 20. K/min, 320. C @ 13. min |
Capillary | Petrocol DH | 1078. | Sojak, Kubinec, et al., 2006 | 150. m/0.25 mm/1.0 μm, 1. K/min; Tstart: 40. C; Tend: 300. C |

References

Gibbons, 1941
Gibbons, L.C.,
, Ph.D. Thesis, Ohio State Univ., Columbus, OH, 1941. [all data]
Casteignau and Villessot, 1968
Casteignau, G.; Villessot, D.,
Identification par chromatographie en phase gaseuse de composés difonctionnels insaturés. I. Synthèse et indices de rétention,
Bull. Soc. Chim. Fr., 1968, 9, 3893-3903. [all data]
Casteignau and Villessot, 1968, 2
Casteignau, G.; Villessot, D.,
Identification par chromatographie en phase gaseuse de composés difonctionnels insaturés. II. Relations entre les structures et les grandeurs chromatographiques,
Bull. Soc. Chim. Fr., 1968, 9, 3904-3907. [all data]
Tsuge, Ohtan, et al., 2011
Tsuge, S.; Ohtan, H.; Watanabe, C.,
Pyrolysis - GC/MS Data Book of Synthetic Polymers, Elsevier, 2011, 420. [all data]
Sojak, Kubinec, et al., 2006
Sojak, L.; Kubinec, R.; Jurdakova, H.; Hajekova, E.; Bajus, M.,
GC-MS of polyethylene and polypropylene thermal cracking produxts,
Petroleum Coal, 2006, 48, 1, 1-14. [all data]