N-(o-Tolyl)ethanolamine
- Formula: C9H13NO
- Molecular weight: 151.2056
- IUPAC Standard InChIKey: DHZZPKMVVSTYLF-UHFFFAOYSA-N
- CAS Registry Number: 136-80-1
- Chemical structure:
View 3d structure (requires JavaScript / HTML 5) - Other names: Ethanol, 2-[(2-methylphenyl)amino]-; o-Toluidino ethanol; o-Tolyl ethanolamine; Ethanol, 2-o-toluidino-; Ethanol, 2-toluidino-; N-(2-Hydroxyethyl)-o-toluidine; 2-(o-Toluidino)ethanol; 2-o-Tolylaminoethanol; Emery 5711; N-β-Hydroxyethyl-o-toluidine; NSC 2152

Phase change data

Data compiled by: Robert L. Brown and Stephen E. Stein
Reduced pressure boiling point
Tboil (K) | Pressure (bar) | Reference |
---|---|---|
438. to 443. | 0.020 | Frinton Laboratories Inc., 1986 |

References

Frinton Laboratories Inc., 1986
Frinton Laboratories Inc.,
Catalog Number 11, Frinton Laboratories Inc., Vineland, NJ, 1986, 99. [all data]