Ethanethioic acid, S-(2-furanylmethyl) ester

Van Den Dool and Kratz RI, polar column, custom temperature program

View large format table.

Column type Active phase I Reference Comment
CapillaryDB-FFAP1769.Huynh-Ba, Matthey-Doret, et al., 200330. m/0.32 mm/0.25 μm; Program: 35C(2min) => 6C/min => 180C => 10C/min => 240C (10min)

Normal alkane RI, non-polar column, temperature ramp

View large format table.

Column type Active phase I Reference Comment
Capillary5 % Phenyl methyl siloxane1163.Zellner, Bicchi, et al., 200830. m/0.25 mm/0.25 μm, 3. K/min; Tstart: 50. C; Tend: 250. C

References

Huynh-Ba, Matthey-Doret, et al., 2003
Huynh-Ba, T.; Matthey-Doret, W.; Fay, L.B.; Rhlid, R.B., Generation of thiols by biotransformation of cysteine-aldehyde conjugates with Baker's yeast, J. Agric. Food Chem., 2003, 51, 12, 3629-3635, https://doi.org/10.1021/jf026198j . [all data]

Zellner, Bicchi, et al., 2008
Zellner, B.d'A.; Bicchi, C.; Dugo, P.; Rubiolo, P.; Dugo, G.; Mondello, L., Linear retention indices in gas chromatographic analysis: a review, Flavour Fragrance J., 2008, 23, 5, 297-314, https://doi.org/10.1002/ffj.1887 . [all data]