Hexylresorcinol
- Formula: C12H18O2
- Molecular weight: 194.2701
- IUPAC Standard InChIKey: WFJIVOKAWHGMBH-UHFFFAOYSA-N
- CAS Registry Number: 136-77-6
- Chemical structure:
View 3d structure (requires JavaScript / HTML 5) - Other names: 1,3-Benzenediol, 4-hexyl-; Resorcinol, 4-hexyl-; p-Hexylresorcinol; Adrover; Antascarin; Ascaricid; Ascarinol; Caprokol; Crystoids; Cystoids Anthelmintic; Hidesol; Oxana; Prensol; S.T. 37; Sucrets; ST-37; 1,3-Dihydroxy-4-Hexylbenzene; 4-n-Hexylresorcinol; 4-Hexyl-1,3-dihydroxybenzene; 4-Hexylresorcine; 4-Hexylresorcinol; NCI-C55787; 1,3-Dihydroxy-4-n-hexylbenzene; 4-(1-Hexyl)resorcinol; Ascaryl; Gelovermin; 4-Hexyl-1,3-benzenediol; Hexylresorcin; Worm-agen; 1-(2',4'-Dihydroxyphenyl)hexane; Mycoderm; NSC 1570

Phase change data

Data compiled as indicated in comments:
BS - Robert L. Brown and Stephen E. Stein
TRC - Thermodynamics Research Center, NIST Boulder Laboratories, Chris Muzny director
AC - William E. Acree, Jr., James S. Chickos
Quantity | Value | Units | Method | Reference | Comment |
---|---|---|---|---|---|
Tboil | 607.2 | K | N/A | Weast and Grasselli, 1989 | BS |
Quantity | Value | Units | Method | Reference | Comment |
Tfus | 341. | K | N/A | Ochsner, 1985 | Uncertainty assigned by TRC = 0.1 K; TRC |
Reduced pressure boiling point
Tboil (K) | Pressure (bar) | Reference | Comment |
---|---|---|---|
452.2 | 0.008 | Weast and Grasselli, 1989 | BS |
Enthalpy of vaporization
ΔvapH (kJ/mol) | Temperature (K) | Method | Reference | Comment |
---|---|---|---|---|
88.1 | 449. | A,GC | Stephenson and Malanowski, 1987 | Based on data from 434. to 494. K. See also Kundel, Lille, et al., 1975.; AC |
Enthalpy of fusion
ΔfusH (kJ/mol) | Temperature (K) | Reference | Comment |
---|---|---|---|
19.04 | 341.5 | Acree, 1991 | AC |

Normal alkane RI, non-polar column, custom temperature program

Column type | Active phase | I | Reference | Comment |
---|---|---|---|---|
Other | Methyl Silicone | 1777. | Ardrey and Moffat, 1981 | Program: not specified |

References

Weast and Grasselli, 1989
CRC Handbook of Data on Organic Compounds, 2nd Editon, Weast,R.C and Grasselli, J.G., ed(s)., CRC Press, Inc., Boca Raton, FL, 1989, 1. [all data]
Ochsner, 1985
Ochsner, A.B.,
, Ph.D. Dissertation, The Ohio State University, 1985. [all data]
Stephenson and Malanowski, 1987
Stephenson, Richard M.; Malanowski, Stanislaw,
Handbook of the Thermodynamics of Organic Compounds, 1987, https://doi.org/10.1007/978-94-009-3173-2
. [all data]
Kundel, Lille, et al., 1975
Kundel, H.; Lille, U.; Kaidas, N.,
Tr. Tallin. Politekh. Inst., 1975, 390, 107. [all data]
Acree, 1991
Acree, William E.,
Thermodynamic properties of organic compounds: enthalpy of fusion and melting point temperature compilation,
Thermochimica Acta, 1991, 189, 1, 37-56, https://doi.org/10.1016/0040-6031(91)87098-H
. [all data]