1H-Pyrrole-2,5-dione, 1,1'-(methylenedi-4,1-phenylene)bis-
- Formula: C21H14N2O4
- Molecular weight: 358.3469
- IUPAC Standard InChIKey: XQUPVDVFXZDTLT-UHFFFAOYSA-N
- CAS Registry Number: 13676-54-5
- Chemical structure:
View 3d structure (requires JavaScript / HTML 5) - Other names: Bismaleimide S; p,p'-Dimaleimidodiphenylmethane; p,p'-Methylenebis(N-phenylmaleimide); Bis(p-maleimidophenyl)methane; Bis(4-maleimidophenyl)methane; Bismaleimide, 4,4'-diphenylmethane; Diphenylmethanebismaleimide; Maleimide, N,N'-(methylenedi-p-phenylene)di-; Methylenedi-p-phenylene-N,N'-bismaleimide; N,N'-(Methylenedi-p-phenylene)dimaleimide; N,N'-(Methylenedi-4,1-phenylene)bismaleimide; N,N'-p,p'-Diphenylmethanebismaleimide; N,N'-Bismaleimido-4,4'-diphenylmethane; N,N'-4,4'-Diaminodiphenylmethanebismaleimide; N,N'-4,4'-Diphenylmethanebismaleimide; 4,4'-(N,N'-Bismaleimido)diphenylmethane; 4,4'-Biphenylmethanebismaleimide; 4,4'-Bis(maleimido)diphenylmethane; 4,4'-Dimaleimidodiphenylmethane; 4,4'-Diphenylmethanebismaleimide; 4,4'-Diphenylmethanedimaleimide; 4,4'-Methylenebis(phenylmaleimide); 4,4'-Methylenebis(N-phenylenemaleimide); 4,4'-Methylenebis(N-phenylmaleimide); 4,4'-Methylenedianiline bismaleimide; p,p'-Bis(N-maleimidophenyl)methane; 4,4'-Bis(maleimidophenyl)methane; NSC 44754; XU 292A; 1,1'-(methylenedi-p-phenylene)bismaleimide

Condensed phase thermochemistry data

Data compiled by: Eugene S. Domalski and Elizabeth D. Hearing
Constant pressure heat capacity of solid
Cp,solid (J/mol*K) | Temperature (K) | Reference | Comment |
---|---|---|---|
118.0 | 298. | Marchidan and Ciopec, 1978 | T = 298 to 571 K. Values for solid seem odd; increase from 118 to 345 J/mol*K at 420 K. |

Phase change data

Data compiled as indicated in comments:
TRC - Thermodynamics Research Center, NIST Boulder Laboratories, Chris Muzny director
DH - Eugene S. Domalski and Elizabeth D. Hearing
Quantity | Value | Units | Method | Reference | Comment |
---|---|---|---|---|---|
Tfus | 430.95 | K | N/A | Marchidan and Ciopec, 1978, 2 | Uncertainty assigned by TRC = 0.1 K; TRC |
Tfus | 430.9 | K | N/A | Marchidan and Ciopec, 1978, 3 | Uncertainty assigned by TRC = 2. K; TRC |
Enthalpy of fusion
ΔfusH (kJ/mol) | Temperature (K) | Reference | Comment |
---|---|---|---|
18.220 | 430.9 | Marchidan and Ciopec, 1978 | DH |
Entropy of fusion
ΔfusS (J/mol*K) | Temperature (K) | Reference | Comment |
---|---|---|---|
42.3 | 430.9 | Marchidan and Ciopec, 1978 | DH |

Reaction thermochemistry data

Data compiled by: Hussein Y. Afeefy, Joel F. Liebman, and Stephen E. Stein
Individual Reactions
+
= C41H28N2O5
By formula: C21H14N2O4 + C20H14O = C41H28N2O5
Quantity | Value | Units | Method | Reference | Comment |
---|---|---|---|---|---|
ΔrH° | -100. | kJ/mol | Cm | Adigezalov, Kiselev, et al., 1991 | liquid phase; solvent: Dioxane |

References

Marchidan and Ciopec, 1978
Marchidan, D.I.; Ciopec, M.,
Relative enthalpies and related thermodynamic functions of some organic compounds by drop calorimetry,
J. Therm. Anal., 1978, 14, 131-150. [all data]
Marchidan and Ciopec, 1978, 2
Marchidan, D.I.; Ciopec, M.,
Relative enthalpies and related thermodynamic functions of some organic compounds by drop calorimetry,
J. Therm. Anal., 1978, 14, 131-49. [all data]
Marchidan and Ciopec, 1978, 3
Marchidan, D.I.; Ciopec, M.,
Thermodynamic properties of maleic, trimellitic and pryomellitic anhydrides,
Rev. Roum. Chim., 1978, 23, 1, 19-20. [all data]
Adigezalov, Kiselev, et al., 1991
Adigezalov, N.R.; Kiselev, V.D.; Konovalov, A.I.,
Bis-reagents in Diels-Alder reactions. V. Kinetics and thermochemistry of reactions of N,N'-bis(dichloromaleimides) with 1,3-diphenylisobenzofuran,
Zh. Org. Khim., 1991, 27, 1774-1779. [all data]