Dihydroxyborane

Condensed phase thermochemistry data

Quantity Value Units Method Reference Comment
Δfsolid-1410.43kJ/molReviewChase, 1998Data last reviewed in March, 1966
Quantity Value Units Method Reference Comment
solid125.46J/mol*KReviewChase, 1998Data last reviewed in March, 1966

Solid Phase Heat Capacity (Shomate Equation)

Cp° = A + B*t + C*t2 + D*t3 + E/t2
H° − H°298.15= A*t + B*t2/2 + C*t3/3 + D*t4/4 − E/t + F − H
S° = A*ln(t) + B*t + C*t2/2 + D*t3/3 − E/(2*t2) + G
    Cp = heat capacity (J/mol*K)
    H° = standard enthalpy (kJ/mol)
    S° = standard entropy (J/mol*K)
    t = temperature (K) / 1000.

View plot Requires a JavaScript / HTML 5 canvas capable browser.

View table.

Temperature (K) 298. - 1500.
A 58.01158
B 279.7343
C -124.5200
D 19.64593
E -1.304317
F -1443.493
G 110.2852
H -1410.426
ReferenceChase, 1998
Comment Data last reviewed in March, 1966

References

Chase, 1998
Chase, M.W., Jr., NIST-JANAF Themochemical Tables, Fourth Edition, J. Phys. Chem. Ref. Data, Monograph 9, 1998, 1-1951. [all data]