Water-t
- Formula: HOT
- Molecular weight: 20.0234
- IUPAC Standard InChIKey: XLYOFNOQVPJJNP-MNYXATJNSA-N
- CAS Registry Number: 13670-17-2
- Chemical structure:
View 3d structure (requires JavaScript / HTML 5) - Isotopologues:

Phase change data

Data compiled by: Thermodynamics Research Center, NIST Boulder Laboratories, Chris Muzny director
Quantity | Value | Units | Method | Reference | Comment |
---|---|---|---|---|---|
Tc | 641.7 | K | N/A | Matsunaga and Nagashima, 1986 | Uncertainty assigned by TRC = 2. K; estimated by comparison with H2O and D2O |
Quantity | Value | Units | Method | Reference | Comment |
Pc | 214.10 | bar | N/A | Matsunaga and Nagashima, 1986 | Uncertainty assigned by TRC = 3.00 bar; estimated by comparison with H2O and D2O |
Quantity | Value | Units | Method | Reference | Comment |
ρc | 19.6 | mol/l | N/A | Matsunaga and Nagashima, 1986 | Uncertainty assigned by TRC = 0.50 mol/l; estimated by comparison with H2O and D2O |

References

Matsunaga and Nagashima, 1986
Matsunaga, N.; Nagashima, A.,
Prediction of the critical constants and the saturation vapor pressure of the tritium oxide.,
Ind. Eng. Chem. Fundam., 1986, 25, 115. [all data]