Dichlorothiolacetic acid
- Formula: C2H2Cl2OS
- Molecular weight: 145.008
- IUPAC Standard InChIKey: FTHIZBAYNLJMRT-UHFFFAOYSA-N
- CAS Registry Number: 13639-16-2
- Chemical structure:
View 3d structure (requires JavaScript / HTML 5) - Other names: α-Dichlorothioacetic acid

Reaction thermochemistry data

Data compiled by: Hussein Y. Afeefy, Joel F. Liebman, and Stephen E. Stein
Individual Reactions
By formula: C2H2Cl2OS + C3H6O = C5H8Cl2O2S
Quantity | Value | Units | Method | Reference | Comment |
---|---|---|---|---|---|
ΔrH° | -27. ± 0.4 | kJ/mol | Eqk | Horii, Kawamura, et al., 1972 | liquid phase; solvent: CD3COCD3; NMR |

References

Horii, Kawamura, et al., 1972
Horii, T.; Kawamura, S.; Tsurugi, J.,
A NMR study of the thioacetic acid-acetone mixture,
Bull. Chem. Soc. Jpn., 1972, 45, 2200-2202. [all data]