Chlorodifluoroamine
- Formula: ClF2N
- Molecular weight: 87.457
- IUPAC Standard InChIKey: ZIOUHCMXEAFYSA-UHFFFAOYSA-N
- CAS Registry Number: 13637-87-1
- Chemical structure:
View 3d structure (requires JavaScript / HTML 5) - Other names: Nitrogen chloride fluoride (nclf2); Difluorochloroamine; Chlorodifluoramine; Chlorodifluoroammonia; Nitrogen chloride difluoride

Vibrational and/or electronic energy levels

Data compiled by: Takehiko Shimanouchi
Symmetry: Cs Symmetry Number σ = 1
Sym. | No | Approximate | Selected Freq. | Infrared | Raman | Comments | ||||
---|---|---|---|---|---|---|---|---|---|---|
Species | type of mode | Value | Rating | Value | Phase | Value | Phase | |||
a' | 1 | NF2 s-str | 930 | C | 930.2 | gas | ||||
a' | 2 | NCl str | 697 | C | 696.9 | gas | ||||
a' | 3 | NF2 deform | 556 | C | 555.5 | gas | ||||
a' | 4 | NClF s-deform | 377 | C | 377 | gas | ||||
a | 5 | NF2 a-str | 855 | C | 855.4 | gas | ||||
a | 6 | NClF a-deform | 382 | D | 382 | gas | Average of two splitting bands | |||
Source: Shimanouchi, 1972

References

Shimanouchi, 1972
Shimanouchi, T.,
Tables of Molecular Vibrational Frequencies Consolidated Volume II,
J. Phys. Chem. Ref. Data, 1972, 6, 3, 993-1102. [all data]