Benzene, 1,4-diethyl-2-methyl-
- Formula: C11H16
- Molecular weight: 148.2447
- IUPAC Standard InChIKey: ZEHGGUIGEDITMM-UHFFFAOYSA-N
- CAS Registry Number: 13632-94-5
- Chemical structure:
View 3d structure (requires JavaScript / HTML 5) - Other names: 1,4-Diethyl-2-methylbenzene; 1-Methyl-2,5-diethylbenzene; Benzene, 2,5-diethyl-1-methyl

Phase change data

Data compiled by: Thermodynamics Research Center, NIST Boulder Laboratories, Chris Muzny director
Quantity | Value | Units | Method | Reference | Comment |
---|---|---|---|---|---|
Tboil | 479. | K | N/A | Mailhe, 1924 | Uncertainty assigned by TRC = 6. K |

References

Mailhe, 1924
Mailhe, A.,
Bull. Soc. Chim. Fr., 1924, 35, 365. [all data]