trans-1,4-dibromocyclohexane
- Formula: C6H10Br2
- Molecular weight: 241.952
- IUPAC Standard InChIKey: OALGWDQLKYPDRK-IZLXSQMJSA-N
- CAS Registry Number: 13618-83-2
- Chemical structure:
View 3d structure (requires JavaScript / HTML 5) - Stereoisomers:

Phase change data

Data compiled by: Thermodynamics Research Center, NIST Boulder Laboratories, Chris Muzny director
Quantity | Value | Units | Method | Reference | Comment |
---|---|---|---|---|---|
Tfus | 386. | K | N/A | Goering and Sims, 1957 | Uncertainty assigned by TRC = 3. K |
Tfus | 385. | K | N/A | Goering and Sims, 1957 | Uncertainty assigned by TRC = 5. K |

References

Goering and Sims, 1957
Goering, H.L.; Sims, L.L.,
Addition of Hydrogen Bromide to 1-Halocyclohexene and the Rearrangement of Dihalocyclohexanes in the Presence of Ferric Chloride,
J. Am. Chem. Soc., 1957, 79, 6270-4. [all data]