2,4-Dimethylthiophenol
- Formula: C8H10S
- Molecular weight: 138.230
- IUPAC Standard InChIKey: AMNLXDDJGGTIPL-UHFFFAOYSA-N
- CAS Registry Number: 13616-82-5
- Chemical structure:
View 3d structure (requires JavaScript / HTML 5) - Other names: Benzenethiol, 2,4-dimethyl-; 2,4-Dimethylbenzenethiol; 2,4-Thioxylenol; 2,4-Xylenethiol

Van Den Dool and Kratz RI, non-polar column, custom temperature program

Column type | Active phase | I | Reference | Comment |
---|---|---|---|---|
Capillary | VF-5MS | 1206.7 | Tret'yakov, 2008 | 30. m/0.25 mm/0.25 μm, He; Program: Multi-step temperature program; T(initial)=60C; T(final)=270C |

References

Tret'yakov, 2008
Tret'yakov, K.V.,
Retention Data. NIST Mass Spectrometry Data Center., NIST Mass Spectrometry Data Center, 2008. [all data]