CAS Reg. No. 136056-48-9

Reaction thermochemistry data

Data compiled by: John E. Bartmess

Individual Reactions

(CAS Reg. No. 136056-48-9 • 4294967295CrF) + CrF = CAS Reg. No. 136056-48-9

By formula: (CAS Reg. No. 136056-48-9 • 4294967295CrF) + CrF = CAS Reg. No. 136056-48-9

Quantity Value Units Method Reference Comment
Δr343. ± 35.kJ/molTDEqBoltalina, Borshchevskii, et al., 1991gas phase; Data at 0 K. See also Pramann and Rademann, 1999; value altered from reference due to conversion from electron convention to ion convention

References

Boltalina, Borshchevskii, et al., 1991
Boltalina, O.V.; Borshchevskii, A.Y.; Sidorov, L.N., Thermochemistry of Chromium Gaseous Fluorides and Their Negative Ions, Zh. Fiz. Khim. SSSR, 1991, 65, 884. [all data]

Pramann and Rademann, 1999
Pramann, A.; Rademann, K., Mass-spectrometric study of formation and stability of manganese and manganese oxide cluster anions, Int. J. Mass Spectrom., 1999, 187, 673-683, https://doi.org/10.1016/S1387-3806(98)14197-0 . [all data]