Benzene, (1-methylpropyl)-
- Formula: C10H14
- Molecular weight: 134.2182
- IUPAC Standard InChIKey: ZJMWRROPUADPEA-UHFFFAOYSA-N
- CAS Registry Number: 135-98-8
- Chemical structure:
- Stereoisomers:
- Other names: Benzene, sec-butyl-; sec-Butylbenzene; 2-Phenylbutane; (1-Methylpropyl)benzene; Secondary butylbenzene; UN 2709; s-Butylbenzene; α-methylpropylbenzene

Gas phase thermochemistry data

Data compiled by: Hussein Y. Afeefy, Joel F. Liebman, and Stephen E. Stein
Quantity | Value | Units | Method | Reference | Comment |
---|---|---|---|---|---|
ΔfH°gas | -17.4 ± 1.4 | kJ/mol | Ccb | Prosen, Johnson, et al., 1946 |

Phase change data

Data compiled as indicated in comments:
BS - Robert L. Brown and Stephen E. Stein
TRC - Thermodynamics Research Center, NIST Boulder Laboratories, Chris Muzny director
AC - William E. Acree, Jr., James S. Chickos
DRB - Donald R. Burgess, Jr.
Quantity | Value | Units | Method | Reference | Comment |
---|---|---|---|---|---|
Tboil | 446. ± 2. | K | AVG | N/A | Average of 40 out of 42 values; Individual data points |
Quantity | Value | Units | Method | Reference | Comment |
Tfus | 197.85 | K | N/A | Birch, Dean, et al., 1949 | Uncertainty assigned by TRC = 0.2 K; TRC |
Tfus | 199.76 | K | N/A | Birch, Dean, et al., 1949 | Uncertainty assigned by TRC = 0.2 K; TRC |
Tfus | 197.68 | K | N/A | Streiff, Murphy, et al., 1947 | Uncertainty assigned by TRC = 0.04 K; TRC |
Tfus | 197.46 | K | N/A | Boord, Greenlee, et al., 1946 | Uncertainty assigned by TRC = 0.1 K; TRC |
Tfus | 197. | K | N/A | Anonymous, 1943 | Uncertainty assigned by TRC = 0.7 K; TRC |
Quantity | Value | Units | Method | Reference | Comment |
ΔvapH° | 47.99 | kJ/mol | N/A | Majer and Svoboda, 1985 | |
ΔvapH° | 48.1 | kJ/mol | N/A | Ru«7825»icka, Zábranský, et al., 1994 | AC |
ΔvapH° | 49.5 | kJ/mol | N/A | Reid, 1972 | AC |
ΔvapH° | 48.6 | kJ/mol | N/A | Prosen, Johnson, et al., 1946 | DRB |
Enthalpy of vaporization
ΔvapH (kJ/mol) | Temperature (K) | Method | Reference | Comment |
---|---|---|---|---|
45.7 ± 0.2 | 340. | EB | Steele, Chirico, et al., 2002 | Based on data from 335. to 491. K.; AC |
43.2 ± 0.2 | 380. | EB | Steele, Chirico, et al., 2002 | Based on data from 335. to 491. K.; AC |
40.6 ± 0.3 | 420. | EB | Steele, Chirico, et al., 2002 | Based on data from 335. to 491. K.; AC |
37.8 ± 0.5 | 460. | EB | Steele, Chirico, et al., 2002 | Based on data from 335. to 491. K.; AC |
50.6 | 258. | N/A | Kasehgari, Mokbel, et al., 1993 | Based on data from 243. to 373. K.; AC |
42.8 | 399. | A | Stephenson and Malanowski, 1987 | Based on data from 384. to 448. K.; AC |
44.0 | 375. | N/A | Forziati, Norris, et al., 1949 | Based on data from 368. to 448. K.; AC |
Antoine Equation Parameters
log10(P) = A − (B / (T + C))
P = vapor pressure (bar)
T = temperature (K)
View plot Requires a JavaScript / HTML 5 canvas capable browser.
Temperature (K) | A | B | C | Reference |
---|---|---|---|---|
360.27 to 447.51 | 4.07587 | 1540.174 | -68.049 | Forziati, Norris, et al., 1949, 2 |

Condensed phase thermochemistry data

Data compiled as indicated in comments:
ALS - Hussein Y. Afeefy, Joel F. Liebman, and Stephen E. Stein
DH - Eugene S. Domalski and Elizabeth D. Hearing
Quantity | Value | Units | Method | Reference | Comment |
---|---|---|---|---|---|
ΔfH°liquid | -15.9 ± 0.3 | kcal/mol | Ccb | Prosen, Johnson, et al., 1946 | ALS |
Quantity | Value | Units | Method | Reference | Comment |
ΔcH°liquid | -1402.85 ± 0.27 | kcal/mol | Ccb | Prosen, Johnson, et al., 1946 | Corresponding ΔfHºliquid = -15.87 kcal/mol (simple calculation by NIST; no Washburn corrections); ALS |
Constant pressure heat capacity of liquid
Cp,liquid (cal/mol*K) | Temperature (K) | Reference | Comment |
---|---|---|---|
57.77 | 293.74 | Andolenko and Grigor'ev, 1979 | T = 294 to 430 K. Unsmoothed experimental datum given as 1.801 kJ/kg*K.; DH |

Gas phase ion energetics data

Data evaluated as indicated in comments:
L - Sharon G. Lias
Data compiled as indicated in comments:
LLK - Sharon G. Lias, Rhoda D. Levin, and Sherif A. Kafafi
RDSH - Henry M. Rosenstock, Keith Draxl, Bruce W. Steiner, and John T. Herron
Quantity | Value | Units | Method | Reference | Comment |
---|---|---|---|---|---|
IE (evaluated) | 8.68 ± 0.01 | eV | N/A | N/A | L |
Ionization energy determinations
IE (eV) | Method | Reference | Comment |
---|---|---|---|
8.68 | EI | McLoughlin, Morrison, et al., 1979 | LLK |
8.68 ± 0.01 | PI | Watanabe, Nakayama, et al., 1962 | RDSH |
8.68 ± 0.01 | PI | Price, Bralsford, et al., 1959 | RDSH |
8.66 ± 0.05 | PE | Nagy-Felsobuki and Peel, 1979 | Vertical value; LLK |
Appearance energy determinations
Ion | AE (eV) | Other Products | Method | Reference | Comment |
---|---|---|---|---|---|
C7H7+ | 10.00 | C3H7 | EI | McLoughlin, Morrison, et al., 1979 | LLK |
C8H9+ | 9.93 | C2H5 | EI | McLoughlin, Morrison, et al., 1979 | LLK |

Kovats' RI, non-polar column, isothermal

Column type | Active phase | Temperature (C) | I | Reference | Comment |
---|---|---|---|---|---|
Capillary | HP-1 | 60. | 997. | Zhang, Li, et al., 1992 | N2; Column length: 25. m; Column diameter: 0.20 mm |
Capillary | HP-1 | 60. | 998. | Zhang, Li, et al., 1992 | N2; Column length: 25. m; Column diameter: 0.20 mm |
Capillary | OV-1 | 100. | 1004.9 | Engewald and Maurer, 1990 | Column length: 60. m; Column diameter: 0.32 mm |
Capillary | OV-1 | 120. | 1010.9 | Engewald and Maurer, 1990 | Column length: 60. m; Column diameter: 0.32 mm |
Capillary | OV-101 | 100. | 1004. | Dimov and Mekenyan, 1989 | Column length: 50. m; Column diameter: 0.25 mm |
Capillary | OV-101 | 100. | 1005. | Matisová, Kovacicová, et al., 1989 | He; Column length: 50. m; Column diameter: 0.20 mm |
Capillary | OV-101 | 100. | 1005. | Matisová, Rukríglová, et al., 1988 | H2; Column length: 278. m; Column diameter: 0.25 mm |
Capillary | OV-101 | 100. | 1006. | Matisová, Rukríglová, et al., 1988 | H2; Column length: 278. m; Column diameter: 0.25 mm |
Capillary | OV-101 | 100. | 1004. | Boneva, Papazova, et al., 1983 | N2; Column length: 85. m; Column diameter: 0.28 mm |
Capillary | OV-101 | 100. | 1006. | Boneva, Papazova, et al., 1983 | N2; Column length: 85. m; Column diameter: 0.28 mm |
Capillary | OV-101 | 100. | 1004. | Boneva, Papazova, et al., 1983 | N2; Column length: 85. m; Column diameter: 0.28 mm |
Capillary | OV-101 | 110. | 1007. | Boneva, Papazova, et al., 1983 | N2; Column length: 85. m; Column diameter: 0.28 mm |
Capillary | OV-101 | 90. | 1000. | Boneva, Papazova, et al., 1983 | N2; Column length: 85. m; Column diameter: 0.28 mm |
Capillary | Squalane | 106. | 990. | Kugucheva and Mashinsky, 1983 | He; Column length: 100. m |
Capillary | Squalane | 96. | 987. | Kugucheva and Mashinsky, 1983 | He; Column length: 100. m |
Capillary | DB-1 | 60. | 992.8 | Lubeck and Sutton, 1983 | Column length: 60. m; Column diameter: 0.264 mm |
Capillary | DB-1 | 60. | 993.3 | Lubeck and Sutton, 1983 | 60. m/0.259 mm/1. μm |
Capillary | SE-30 | 70. | 997.0 | Tóth, 1983 | N2; Column length: 15. m; Column diameter: 0.25 mm |
Capillary | SE-30 | 130. | 1017. | Bredael, 1982 | Column length: 100. m; Column diameter: 0.5 mm |
Capillary | SE-30 | 80. | 1000. | Bredael, 1982 | Column length: 100. m; Column diameter: 0.5 mm |
Capillary | OV-101 | 100. | 1006. | Gerasimenko and Nabivach, 1982 | N2; Column length: 50. m; Column diameter: 0.30 mm |
Capillary | OV-101 | 120. | 1012. | Gerasimenko and Nabivach, 1982 | N2; Column length: 50. m; Column diameter: 0.30 mm |
Capillary | OV-101 | 140. | 1019. | Gerasimenko and Nabivach, 1982 | N2; Column length: 50. m; Column diameter: 0.30 mm |
Capillary | Squalane | 86. | 986.4 | Macák, Nabivach, et al., 1982 | N2; Column length: 50. m; Column diameter: 0.25 mm |
Capillary | Squalane | 96. | 989.1 | Macák, Nabivach, et al., 1982 | N2; Column length: 50. m; Column diameter: 0.25 mm |
Capillary | OV-101 | 100. | 1005.7 | Gerasimenko, Kirilenko, et al., 1981 | N2; Column length: 50. m; Column diameter: 0.3 mm |
Capillary | OV-101 | 120. | 1011.9 | Gerasimenko, Kirilenko, et al., 1981 | N2; Column length: 50. m; Column diameter: 0.3 mm |
Capillary | OV-101 | 140. | 1019.2 | Gerasimenko, Kirilenko, et al., 1981 | N2; Column length: 50. m; Column diameter: 0.3 mm |
Capillary | Squalane | 86. | 986.4 | Nabivach and Kirilenko, 1979 | N2; Column length: 50. m |
Capillary | Squalane | 86. | 986.4 | Nabivach, Bur'yan, et al., 1978 | Column length: 50. m; Column diameter: 0.25 mm |
Capillary | Squalane | 96. | 989.1 | Nabivach, Bur'yan, et al., 1978 | Column length: 50. m; Column diameter: 0.25 mm |
Capillary | Squalane | 100. | 990. | Engewald and Wennrich, 1976 | N2; Column length: 100. m; Column diameter: 0.23 mm |
Capillary | Squalane | 80. | 983.15 | Soják and Rijks, 1976 | H2; Column length: 100. m; Column diameter: 0.25 mm |
Capillary | SE-30 | 130. | 1015. | Mitra, Mohan, et al., 1974 | H2; Column length: 6.1 m; Column diameter: 3.18 mm |
Capillary | SE-30 | 65. | 993.1 | Svob, Deur-Siftar, et al., 1974 | He; Column length: 25.5 m; Column diameter: 0.5 mm |
Capillary | SE-30 | 65. | 993.1 | Svob and Deur-Siftar, 1974 | He; Column length: 25.5 m; Column diameter: 0.5 mm |
Capillary | Squalane | 100. | 989.8 | Svob and Deur-Siftar, 1974 | He; Column length: 10.5 m; Column diameter: 0.25 mm |

Kovats' RI, non-polar column, temperature ramp

Column type | Active phase | I | Reference | Comment |
---|---|---|---|---|
Capillary | OV-101 | 995. | Hayes and Pitzer, 1982 | 110. m/0.25 mm/0.20 μm, He, 1. K/min; Tstart: 35. C; Tend: 200. C |
Capillary | Apiezon L | 1010. | Louis, 1971 | N2, 1. K/min; Column length: 50. m; Column diameter: 0.25 mm; Tstart: 60. C |

Kovats' RI, non-polar column, custom temperature program

Column type | Active phase | I | Reference | Comment |
---|---|---|---|---|
Capillary | Petrocol DH-100 | 997.9 | Haagen-Smit Laboratory, 1997 | He; Column length: 100. m; Column diameter: 0.2 mm; Program: 5C(10min) => 5C/min => 50C(48min) => 1.5C/min => 195C(91min) |
Capillary | DB-1 | 995. | Hoekman, 1993 | 60. m/0.32 mm/1.0 μm, He; Program: -40 C for 12 min; -40 - 125 C at 3 deg.min; 125-185 C at 6 deg/min; 185 - 220 C at 20 deg/min; hold 220 C for 2 min |

Kovats' RI, polar column, isothermal

Column type | Active phase | Temperature (C) | I | Reference | Comment |
---|---|---|---|---|---|
Capillary | PEG-20M | 70. | 1248.1 | Tóth, 1983 | N2; Column length: 30. m; Column diameter: 0.3 mm |
Capillary | Carbowax 20M | 100. | 1241.7 | Engewald and Wennrich, 1976 | N2; Column length: 100. m; Column diameter: 0.23 mm |
Capillary | Carbowax 20M | 90. | 1227.2 | Döring, Estel, et al., 1974 | Column length: 100. m; Column diameter: 0.2 mm |

Van Den Dool and Kratz RI, non-polar column, temperature ramp

Column type | Active phase | I | Reference | Comment |
---|---|---|---|---|
Capillary | CP-Sil 8CB-MS | 1014. | Elmore, Cooper, et al., 2005 | 0. m/0.25 mm/0.25 μm, He, 40. C @ 2. min, 4. K/min, 280. C @ 5. min |
Capillary | DB-5 | 1006.4 | Song, Lai, et al., 2003 | 30. m/0.25 mm/0.25 μm, He, 2. K/min; Tstart: 40. C; Tend: 310. C |
Capillary | DB-5 | 1008.9 | Song, Lai, et al., 2003 | 30. m/0.25 mm/0.25 μm, He, 4. K/min; Tstart: 40. C; Tend: 310. C |
Capillary | DB-5 | 1011.7 | Song, Lai, et al., 2003 | 30. m/0.25 mm/0.25 μm, He, 6. K/min; Tstart: 40. C; Tend: 310. C |
Capillary | DB-1 | 992.1 | Sun and Stremple, 2003 | 30. m/0.25 mm/0.25 μm, He, 3. K/min; Tstart: 40. C; Tend: 325. C |
Capillary | PONA | 994.1 | Martos, Saraullo, et al., 1997 | 50. m/0.2 mm/0.5 μm, 35. C @ 0.5 min, 1. K/min, 220. C @ 8. min |
Capillary | PONA | 994.7 | Martos, Saraullo, et al., 1997 | 50. m/0.2 mm/0.5 μm, 35. C @ 0.5 min, 1. K/min, 220. C @ 8. min |
Capillary | OV-1 | 999.1 | Gautzsch and Zinn, 1996 | 8. K/min; Tstart: 35. C; Tend: 300. C |
Capillary | DB-5 | 1006.4 | Lai and Song, 1995 | 30. m/0.25 mm/0.25 μm, He, 2. K/min; Tstart: 40. C; Tend: 310. C |
Capillary | DB-5 | 1008.9 | Lai and Song, 1995 | 30. m/0.25 mm/0.25 μm, He, 4. K/min; Tstart: 40. C; Tend: 310. C |
Capillary | DB-5 | 1011.7 | Lai and Song, 1995 | 30. m/0.25 mm/0.25 μm, He, 6. K/min; Tstart: 40. C; Tend: 310. C |
Capillary | Petrocol DH | 996.5 | White, Douglas, et al., 1992 | 100. m/0.25 mm/0.5 μm, He, 1. K/min; Tstart: 30. C; Tend: 220. C |
Capillary | Petrocol DH | 996.78 | White, Douglas, et al., 1992 | 100. m/0.25 mm/0.5 μm, He, 1. K/min; Tstart: 30. C; Tend: 220. C |
Capillary | Petrocol DH | 997. | White, Hackett, et al., 1992 | 100. m/0.25 mm/0.5 μm, He, 1. K/min; Tstart: 30. C; Tend: 220. C |
Capillary | DB-5 | 1006. | Morinaga, Hara, et al., 1990 | 15. m/0.53 mm/1.5 μm, He, 4. K/min; Tstart: 40. C; Tend: 90. C |
Capillary | OV-101 | 995. | Hayes and Pitzer, 1981 | 108. m/0.25 mm/0.2 μm, 1. K/min; Tstart: 35. C; Tend: 200. C |

Van Den Dool and Kratz RI, polar column, temperature ramp

Column type | Active phase | I | Reference | Comment |
---|---|---|---|---|
Capillary | Supelcowax-10 | 1259. | Elmore, Nisyrios, et al., 2005 | 60. m/0.25 mm/0.25 μm, He, 40. C @ 2. min, 4. K/min; Tend: 280. C |
Capillary | Supelcowax-10 | 1312. | Elmore, Nisyrios, et al., 2005 | 60. m/0.25 mm/0.25 μm, He, 40. C @ 2. min, 4. K/min; Tend: 280. C |

Normal alkane RI, non-polar column, isothermal

Column type | Active phase | Temperature (C) | I | Reference | Comment |
---|---|---|---|---|---|
Capillary | Squalane | 95.4 | 983. | Sojak and Vigdergauz, 1978 | H2 |
Capillary | Squalane | 110. | 994. | Papazova and Pankova, 1975 | N2; Column length: 100. m; Column diameter: 0.25 mm |
Capillary | Squalane | 130. | 998. | Papazova and Pankova, 1975 | N2; Column length: 100. m; Column diameter: 0.25 mm |

Normal alkane RI, non-polar column, temperature ramp

Column type | Active phase | I | Reference | Comment |
---|---|---|---|---|
Capillary | Polydimethyl siloxane: CP-Sil 5 CB | 984. | Bramston-Cook, 2013 | 60. m/0.25 mm/1.0 μm, Helium, 45. C @ 1.45 min, 3.6 K/min, 210. C @ 2.72 min |
Capillary | Petrocol DH | 997. | Supelco, 2012 | 100. m/0.25 mm/0.50 μm, Helium, 20. C @ 15. min, 15. K/min, 220. C @ 30. min |
Capillary | Petrocol DH | 1000. | Supelco, 2012 | 100. m/0.25 mm/0.50 μm, Helium, 20. C @ 15. min, 15. K/min, 220. C @ 30. min |
Capillary | DB-1 | 997. | Zenkevich, Ukolov, et al., 2011 | 30. m/0.32 mm/0.25 μm, Nitrogen, 5. K/min; Tstart: 100. C; Tend: 200. C |
Capillary | OV-1 | 996. | Orav, Kailas, et al., 1999 | 2. K/min; Tstart: 50. C; Tend: 160. C |
Capillary | HP-5 | 1015.2 | Wang and Fingas, 1995 | 30. m/0.25 mm/0.25 μm, He, 35. C @ 2. min, 10. K/min, 300. C @ 10. min |
Capillary | DB-1 | 997. | Ciccioli, Cecinato, et al., 1992 | 60. m/0.32 mm/1.2 μm, He, 30. C @ 10. min, 3. K/min; Tend: 240. C |
Capillary | CP Sil 5 CB | 994. | Hartgers, Damste, et al., 1992 | 25. m/0.32 mm/0.45 μm, He, 0. C @ 5. min, 3. K/min, 320. C @ 10. min |
Capillary | SE-30 | 997. | Heydanek and McGorrin, 1981 | He, 40. C @ 3. min, 3. K/min; Column length: 50. m; Column diameter: 0.5 mm; Tend: 170. C |

Normal alkane RI, non-polar column, custom temperature program

Column type | Active phase | I | Reference | Comment |
---|---|---|---|---|
Capillary | SE-30 | 1011. | Vinogradov, 2004 | Program: not specified |
Capillary | Polymethylsiloxane, (PMS-20000) | 997. | Cornwell and Cordano, 2003 | Program: not specified |
Capillary | OV-101 | 1006. | Zhu and Wang, 2001 | Program: not specified |
Capillary | DB-1 | 993. | Zhu and Wang, 2001 | Program: not specified |
Capillary | Methyl Silicone | 998. | Spieksma, 1999 | Program: not specified |
Capillary | SE-30 | 1006. | Xiuhua, Zhang, et al., 1996 | Program: not specified |
Capillary | SE-30 | 997. | Xiuhua, Zhang, et al., 1996 | Program: not specified |
Capillary | DB-1 | 995. | Ciccioli, Cecinato, et al., 1994 | 60. m/0.32 mm/0.25 μm; Program: not specified |
Capillary | DB-1 | 994. | Hathcock and Bertsch, 1993 | 100. m/0.25 mm/0.5 μm; Program: not specified |
Capillary | OV-1 | 1005. | Engewald and Maurer, 1990 | Column length: 60. m; Column diameter: 0.32 mm; Program: 1) 1st 30m column temp ramp 4C/min 60-120C 2)2nd 30m column isothermal 100C |
Capillary | OV-1 | 1012. | Engewald and Maurer, 1990 | Column length: 60. m; Column diameter: 0.32 mm; Program: 1) 1st 30m column temp ramp 4C/min 60-120C. 2) 2nd 30m column isothermal 120C. |
Capillary | OV-1 | 1008.7 | Engewald and Maurer, 1990 | Column length: 60. m; Column diameter: 0.32 mm; Program: 1) 1st 30m column temp ramp 6C/min 60-120C. 2) 2nd 30m column isothermal 120C. |
Capillary | OV-1 | 1010.7 | Engewald and Maurer, 1990 | Column length: 60. m; Column diameter: 0.32 mm; Program: 1)1st 30m column temp ramp 3C/min 60-120 2)2nd 30m column isothermal 120C |
Capillary | Squalane | 990. | Dimov and Mekenyan, 1989 | Program: not specified |
Capillary | OV-1, SE-30, Methyl silicone, SP-2100, OV-101, DB-1, etc. | 993. | Waggott and Davies, 1984 | Hydrogen; Column length: 50. m; Column diameter: 0.32 mm; Program: not specified |
Capillary | OV-1, SE-30, Methyl silicone, SP-2100, OV-101, DB-1, etc. | 996. | Waggott and Davies, 1984 | Hydrogen; Column length: 50. m; Column diameter: 0.32 mm; Program: not specified |
Capillary | Methyl Silicone | 1002. | Bonchev, Mekenjan, et al., 1979 | Program: not specified |
Packed | SE-30 | 1020. | Robinson and Odell, 1971 | N2, Chromosorb W; Column length: 6.1 m; Program: 50C910min) => 20C/min => 90(6min) => 10C/min => 150C(hold) |
Packed | Squalane | 994. | Robinson and Odell, 1971 | N2, Embacel; Column length: 3.0 m; Program: 25C(5min) => 2C/min => 35 => 4C/min => 95C(hold) |

Normal alkane RI, polar column, isothermal

Column type | Active phase | Temperature (C) | I | Reference | Comment |
---|---|---|---|---|---|
Capillary | PEG-40M | 100. | 1260. | Nesterov, Nesterova, et al., 2000 | Column length: 50. m |
Capillary | PEG-40M | 100. | 1262. | Nesterov, Nesterova, et al., 2000 | Column length: 50. m |
Capillary | PEG-40M | 120. | 1273. | Nesterov, Nesterova, et al., 2000 | Column length: 50. m |
Capillary | PEG-40M | 140. | 1287. | Nesterov, Nesterova, et al., 2000 | Column length: 50. m |
Capillary | PEG-40M | 160. | 1298. | Nesterov, Nesterova, et al., 2000 | Column length: 50. m |
Capillary | PEG-40M | 80. | 1250. | Nesterov, Nesterova, et al., 2000 | Column length: 50. m |
Capillary | Carbowax 20M | 90. | 1227. | Sutter, Peterson, et al., 1997 |

Normal alkane RI, polar column, temperature ramp

Column type | Active phase | I | Reference | Comment |
---|---|---|---|---|
Capillary | Carbowax 20M | 1311. | Herain, MRAVEC, et al., 1991 | 70. C @ 21. min, 5. K/min, 150. C @ 999. min |
Capillary | Carbowax 20M | 1224. | Herain, MRAVEC, et al., 1991 | 70. C @ 21. min, 5. K/min, 150. C @ 999. min |

Normal alkane RI, polar column, custom temperature program

Column type | Active phase | I | Reference | Comment |
---|---|---|---|---|
Capillary | Carbowax 20M | 1248. | Cornwell and Cordano, 2003 | Program: not specified |
Capillary | Carbowax 20M | 1227. | Ivanciuc, Ivanciuc, et al., 2001 | Program: not specified |
Capillary | PEG-20M | 1248. | Xiuhua, Zhang, et al., 1996 | Program: not specified |
Capillary | Carbowax 20M | 1235. | Dimov and Mekenyan, 1989 | Program: not specified |

Henry's Law data

Data compiled by: Rolf Sander

Henry's Law constant (water solution)

kH(T) = H exp(d(ln(kH))/d(1/T) ((1/T) - 1/(298.15 K)))
H = Henry's law constant for solubility in water at 298.15 K (mol/(kg*bar))
d(ln(kH))/d(1/T) = Temperature dependence constant (K)

H (mol/(kg*bar)) d(ln(kH))/d(1/T) (K) Method Reference
0.072 LN/A
0.087 VN/A

References

Prosen, Johnson, et al., 1946
Prosen, E.J.; Johnson, W.H.; Rossini, F.D.,
Heats of combustion and formation at 25°C of the alkylbenzenes through C10H14, and of the higher normal monoalkylbenzenes,
J. Res. NBS, 1946, 36, 455-461. [all data]
Birch, Dean, et al., 1949
Birch, S.F.; Dean, R.A.; Fidler, F.A.; Lowry, R.A.,
The preparation of the c(10) monocyclic aromatic hydrocarbons,
J. Am. Chem. Soc., 1949, 71, 1362. [all data]
Streiff, Murphy, et al., 1947
Streiff, A.J.; Murphy, E.T.; Cahill, J.C.; Flanagan, H.F.; Sedlak, V.A.; Willingham, C.B.; Rossini, F.D.,
Purification, Purity, and Freezing Points of 8 Nonanes, 11 Alkyl- cyclopentanes, 6 Alkylcyclohexanes, and 4 Butylbenzenes of the API-NBS Series,
J. Res. Natl. Bur. Stand. (U. S.), 1947, 38, 53. [all data]
Boord, Greenlee, et al., 1946
Boord, C.E.; Greenlee, K.W.; Perilstein, W.L.,
The Synthesis, Purification and Prop. of Hydrocarbons of Low Mol. Weight, Am. Pet. Inst. Res. Proj. 45, Eighth Annu. Rep., Ohio State Univ., June 30, 1946. [all data]
Anonymous, 1943
Anonymous, R.,
, Sunbury Rep. No. 2176, Anglo-Iranian Oil Co., 1943. [all data]
Majer and Svoboda, 1985
Majer, V.; Svoboda, V.,
Enthalpies of Vaporization of Organic Compounds: A Critical Review and Data Compilation, Blackwell Scientific Publications, Oxford, 1985, 300. [all data]
Ru«7825»icka, Zábranský, et al., 1994
Ru«7825»icka, Vlastimil; Zábranský, Milan; Ru«7825»icka, Kvetoslav; Majer, Vladimír,
Vapor pressures for a group of high-boiling alkylbenzenes under environmental conditions,
Thermochimica Acta, 1994, 245, 121-144, https://doi.org/10.1016/0040-6031(94)85073-9
. [all data]
Reid, 1972
Reid, Robert C.,
Handbook on vapor pressure and heats of vaporization of hydrocarbons and related compounds, R. C. Wilhort and B. J. Zwolinski, Texas A Research Foundation. College Station, Texas(1971). 329 pages.$10.00,
AIChE J., 1972, 18, 6, 1278-1278, https://doi.org/10.1002/aic.690180637
. [all data]
Steele, Chirico, et al., 2002
Steele, W.V.; Chirico, R.D.; Knipmeyer, S.E.; Nguyen, A.,
Vapor Pressure, Heat Capacity, and Density along the Saturation Line: Measurements for Benzenamine, Butylbenzene, sec -Butylbenzene, tert -Butylbenzene, 2,2-Dimethylbutanoic Acid, Tridecafluoroheptanoic Acid, 2-Butyl-2-ethyl-1,3-propanediol, 2,2,4-Trimethyl-1,3-pentanediol, and 1-Chloro-2-propanol,
J. Chem. Eng. Data, 2002, 47, 4, 648-666, https://doi.org/10.1021/je010083e
. [all data]
Kasehgari, Mokbel, et al., 1993
Kasehgari, H.; Mokbel, I.; Viton, C.; Jose, J.,
Vapor pressure of 11 alkylbenzenes in the range 10-3 -- 280 torr, correlation by equation of state,
Fluid Phase Equilibria, 1993, 87, 1, 133-152, https://doi.org/10.1016/0378-3812(93)85022-E
. [all data]
Stephenson and Malanowski, 1987
Stephenson, Richard M.; Malanowski, Stanislaw,
Handbook of the Thermodynamics of Organic Compounds, 1987, https://doi.org/10.1007/978-94-009-3173-2
. [all data]
Forziati, Norris, et al., 1949
Forziati, Alphonse F.; Norris, William R.; Rossini, Frederick D.,
Vapor pressures and boiling points of sixty API-NBS hydrocarbons,
J. RES. NATL. BUR. STAN., 1949, 43, 6, 555-17, https://doi.org/10.6028/jres.043.050
. [all data]
Forziati, Norris, et al., 1949, 2
Forziati, A.F.; Norris, W.R.; Rossini, F.D.,
Vapor Pressures and Boiling Points of Sixty API-NBS Hydrocarbons,
J. Res. Natl. Bur. Stand. (U.S.), 1949, 43, 6, 555-563, https://doi.org/10.6028/jres.043.050
. [all data]