beryllium sulphide
- Formula: BeS
- Molecular weight: 41.077
- IUPAC Standard InChIKey: FQDSYGKTHDFFCM-UHFFFAOYSA-N
- CAS Registry Number: 13598-22-6
- Chemical structure:
View 3d structure (requires JavaScript / HTML 5) - Other names: Beryllium sulfide

Gas phase thermochemistry data

Quantity | Value | Units | Method | Reference | Comment |
---|---|---|---|---|---|
ΔfH°gas | 263.59 | kJ/mol | Review | Chase, 1998 | Data last reviewed in September, 1977 |
Quantity | Value | Units | Method | Reference | Comment |
S°gas,1 bar | 210.29 | J/mol*K | Review | Chase, 1998 | Data last reviewed in September, 1977 |
Gas Phase Heat Capacity (Shomate Equation)
Cp° = A + B*t + C*t2 + D*t3 +
E/t2
H° − H°298.15= A*t + B*t2/2 +
C*t3/3 + D*t4/4 − E/t + F − H
S° = A*ln(t) + B*t + C*t2/2 + D*t3/3 −
E/(2*t2) + G
Cp = heat capacity (J/mol*K)
H° = standard enthalpy (kJ/mol)
S° = standard entropy (J/mol*K)
t = temperature (K) / 1000.
View plot Requires a JavaScript / HTML 5 canvas capable browser.
Temperature (K) | 298. to 1000. | 1000. to 3000. | 3000. to 6000. |
---|---|---|---|
A | 19.72220 | -14.98610 | 241.6540 |
B | 46.94480 | 31.95960 | -79.18500 |
C | -49.38230 | 4.791720 | 11.65930 |
D | 19.59320 | -2.480501 | -0.605610 |
E | 0.083282 | 17.92170 | -299.9510 |
F | 256.3020 | 303.8200 | -171.7000 |
G | 222.6480 | 226.8420 | 212.8840 |
H | 263.5920 | 263.5920 | 263.5920 |
Reference | Chase, 1998 | Chase, 1998 | Chase, 1998 |
Comment | Data last reviewed in September, 1977 | Data last reviewed in September, 1977 | Data last reviewed in September, 1977 |

Condensed phase thermochemistry data

Quantity | Value | Units | Method | Reference | Comment |
---|---|---|---|---|---|
ΔfH°solid | -234.30 | kJ/mol | Review | Chase, 1998 | Data last reviewed in September, 1977 |
Quantity | Value | Units | Method | Reference | Comment |
S°solid | 36.89 | J/mol*K | Review | Chase, 1998 | Data last reviewed in September, 1977 |
Solid Phase Heat Capacity (Shomate Equation)
Cp° = A + B*t + C*t2 + D*t3 +
E/t2
H° − H°298.15= A*t + B*t2/2 +
C*t3/3 + D*t4/4 − E/t + F − H
S° = A*ln(t) + B*t + C*t2/2 + D*t3/3 −
E/(2*t2) + G
Cp = heat capacity (J/mol*K)
H° = standard enthalpy (kJ/mol)
S° = standard entropy (J/mol*K)
t = temperature (K) / 1000.
View plot Requires a JavaScript / HTML 5 canvas capable browser.
Temperature (K) | 298. to 3000. |
---|---|
A | 44.73198 |
B | 21.86056 |
C | -8.637073 |
D | 1.349927 |
E | -1.473104 |
F | -253.5240 |
G | 76.59440 |
H | -234.3044 |
Reference | Chase, 1998 |
Comment | Data last reviewed in September, 1977 |

Constants of diatomic molecules

Data compiled by: Klaus P. Huber and Gerhard H. Herzberg
Data collected through April, 1976
Symbol | Meaning |
---|---|
State | electronic state and / or symmetry symbol |
Te | minimum electronic energy (cm-1) |
ωe | vibrational constant – first term (cm-1) |
ωexe | vibrational constant – second term (cm-1) |
ωeye | vibrational constant – third term (cm-1) |
Be | rotational constant in equilibrium position (cm-1) |
αe | rotational constant – first term (cm-1) |
γe | rotation-vibration interaction constant (cm-1) |
De | centrifugal distortion constant (cm-1) |
βe | rotational constant – first term, centrifugal force (cm-1) |
re | internuclear distance (Å) |
Trans. | observed transition(s) corresponding to electronic state |
ν00 | position of 0-0 band (units noted in table) |
State | Te | ωe | ωexe | ωeye | Be | αe | γe | De | βe | re | Trans. | ν00 |
---|---|---|---|---|---|---|---|---|---|---|---|---|
b (3Π) | (b ← a) R | 25961.8 H | ||||||||||
↳missing citation | ||||||||||||
(b ← a) R | 25941.8 H | |||||||||||
↳missing citation | ||||||||||||
(b ← a) R | 25924.5 H | |||||||||||
↳missing citation | ||||||||||||
B lΣ+ | 25941.6 1 | 851.35 Z | 4.85 | 0.72894 | 0.00604 | -0.00003 | 0.00000214 | 1.81368 | B ↔ X R | 25868.61 Z | ||
↳Gissane and Barrow, 1963; missing citation | ||||||||||||
State | Te | ωe | ωexe | ωeye | Be | αe | γe | De | βe | re | Trans. | ν00 |
C (1Δ) | 13545.8 | [660.7] 1 | 5.5 | [0.5963] 1 | 0.0069 | [2.005] 1 | ||||||
A 1Π | 7960.1 | 762.46 2 Z | 4.12 | 0.6590 2 3 4 | 0.00605 | 0.000025 | 0.000002 | 1.9075 | A → X R | 7842.9 2 Z | ||
↳missing citation | ||||||||||||
a (3Π) | ||||||||||||
X 1Σ+ | 0 5 | 997.94 Z | 6.137 | 0.79059 | O.OO664 | -0.00002 | 0.000002 | 1.74153 |

References

Chase, 1998
Chase, M.W., Jr.,
NIST-JANAF Themochemical Tables, Fourth Edition,
J. Phys. Chem. Ref. Data, Monograph 9, 1998, 1-1951. [all data]
Gissane and Barrow, 1963
Gissane, W.J.M.; Barrow, R.F.,
Rotational analysis of a system B1Σ+ ← X1Σ+ of BeS,
Proc. Phys. Soc. London, 1963, 82, 1065. [all data]
Verhaegen and Richards, 1967
Verhaegen, G.; Richards, W.G.,
The ground state of the BeS molecule,
Proc. Phys. Soc. London, 1967, 90, 579. [all data]
Gaydon, 1968
Gaydon, A.G.,
Dissociation energies and spectra of diatomic molecules, Chapman and Hall, Ltd., 3rd Edition, London, 1968, 1. [all data]