Niobium trichloride oxide

Phase change data

Data compiled by: William E. Acree, Jr., James S. Chickos

Quantity Value Units Method Reference Comment
Δsub124. ± 16.kJ/molN/ATürler, Eichler, et al., 1996

References

Türler, Eichler, et al., 1996
Türler, A.; Eichler, B.; Jost, D.T.; Piguet, D.; Gäggeler, H.W.; Gregorich, K.E.; Kadkhodayan, B.; Kreek, S.A.; Lee, D.M.; Mohar, M.; Sylwester, E.; Hoffman, D.C.; Hübener, S., On-line Gas Phase Chromatography with Chlorides of Niobium and Hahnium (Element 105), Radiochimca Acta, 1996, 73, 2, 55-66, https://doi.org/10.1524/ract.1996.73.2.55 . [all data]