1-(4-chlorophenyl)-1,3-dimethylurea
- Formula: C9H11ClN2O
- Molecular weight: 198.649
- IUPAC Standard InChIKey: XZTUYISAOWDOSC-UHFFFAOYSA-N
- CAS Registry Number: 13578-25-1
- Chemical structure:
View 3d structure (requires JavaScript / HTML 5) - Other names: Urea, N-(4-chlorophenyl)-N,N'-dimethyl-

Reaction thermochemistry data

Data compiled by: Hussein Y. Afeefy, Joel F. Liebman, and Stephen E. Stein
Individual Reactions
By formula: C9H11ClN2O = C7H4ClNO + C2H7N
Quantity | Value | Units | Method | Reference | Comment |
---|---|---|---|---|---|
ΔrH° | 155.0 ± 2.5 | kJ/mol | Eqk | Chimishkyan, Svetlova, et al., 1984 | solid phase; Dissociation |

References

Chimishkyan, Svetlova, et al., 1984
Chimishkyan, A.L.; Svetlova, L.P.; Leonova, T.V.; Gluyaev, N.D.,
Thermal decomposition of substituted ureas,
J. Gen. Chem. USSR, 1984, 54, 1317-1320. [all data]