HGa
- Formula: GaH
- Molecular weight: 70.731
- CAS Registry Number: 13572-92-4

Reaction thermochemistry data

Data compiled by: John E. Bartmess
Individual Reactions
Quantity | Value | Units | Method | Reference | Comment |
---|---|---|---|---|---|
ΔrH° | 1546. ± 14. | kJ/mol | D-EA | Williams, Carpenter, et al., 1998 | gas phase |
Quantity | Value | Units | Method | Reference | Comment |
ΔrG° | 1523. ± 15. | kJ/mol | H-TS | Williams, Carpenter, et al., 1998 | gas phase |

Gas phase ion energetics data

Data compiled by: John E. Bartmess
De-protonation reactions
Quantity | Value | Units | Method | Reference | Comment |
---|---|---|---|---|---|
ΔrH° | 1546. ± 14. | kJ/mol | D-EA | Williams, Carpenter, et al., 1998 | gas phase |
Quantity | Value | Units | Method | Reference | Comment |
ΔrG° | 1523. ± 15. | kJ/mol | H-TS | Williams, Carpenter, et al., 1998 | gas phase |

References

Williams, Carpenter, et al., 1998
Williams, W.W.; Carpenter, D.L.; Covington, A.M.; Koepnick, M.C.; Calabrese, D.; Thompson, J.S.,
Laser photodetachment electron spectrometry of Ga-,
J. Phys. B: Atom. Mol. Opt. Phys., 1998, 31, 8, L341-L345, https://doi.org/10.1088/0953-4075/31/8/003
. [all data]