2-Bornanone oxime
- Formula: C10H17NO
- Molecular weight: 167.2481
- IUPAC Standard InChIKey: OVFDEGGJFJECAT-UHFFFAOYSA-N
- CAS Registry Number: 13559-66-5
- Chemical structure:
View 3d structure (requires JavaScript / HTML 5) - Stereoisomers:
- Other names: Bicyclo[2.2.1]heptan-2-one, 1,7,7-trimethyl-, oxime; Camphor, oxime; DL-Camphor oxime; Camphor, d-oxime; Kampferoxim; 2-Camphanone oxime; 1,7,7-Trimethylbicyclo[2.2.1]heptan-2-one oxime; (.+/-.)-Camphor oxime; NSC 193372; bornan-2-one oxime

Phase change data

Data compiled as indicated in comments:
TRC - Thermodynamics Research Center, NIST Boulder Laboratories, Chris Muzny director
AC - William E. Acree, Jr., James S. Chickos
Quantity | Value | Units | Method | Reference | Comment |
---|---|---|---|---|---|
Tfus | 388. | K | N/A | Mjojo, 1979 | Crystal phase 1 phase; Uncertainty assigned by TRC = 1. K; TRC |
Enthalpy of fusion
ΔfusH (kJ/mol) | Temperature (K) | Method | Reference | Comment |
---|---|---|---|---|
1.2 | 388. | DSC | Mjojo, 1979, 2 | AC |

References

Mjojo, 1979
Mjojo, C.C.,
Order-disorder phenomena: part 2. order-disorder phase equilibria in d-and l-systems of camphor and related compounds.,
J. Chem. Soc., Faraday Trans. 2, 1979, 75, 692-703. [all data]
Mjojo, 1979, 2
Mjojo, Chodziwadziwa C.,
Order?disorder phenomena. Part 2.?Order?disorder phase equilibria in D- and L-systems of camphor and related compounds,
J. Chem. Soc., Faraday Trans. 2, 1979, 75, 692, https://doi.org/10.1039/f29797500692
. [all data]