2-Butanone, 1-chloro-3,3-dimethyl-
- Formula: C6H11ClO
- Molecular weight: 134.604
- IUPAC Standard InChIKey: ULSAJQMHTGKPIY-UHFFFAOYSA-N
- CAS Registry Number: 13547-70-1
- Chemical structure:
View 3d structure (requires JavaScript / HTML 5) - Other names: 1-Chloro-3,3-dimethyl-2-butanone; α-Chloropinacolone; Chloromethyl tert-butyl ketone; tert-Butyl chloromethyl ketone; 1-Chloropinacolone; 1-chloro-3,3-dimethylbutan-2-one

Phase change data

Data compiled as indicated in comments:
BS - Robert L. Brown and Stephen E. Stein
TRC - Thermodynamics Research Center, NIST Boulder Laboratories, Chris Muzny director
Quantity | Value | Units | Method | Reference | Comment |
---|---|---|---|---|---|
Tboil | 444.7 | K | N/A | Aldrich Chemical Company Inc., 1990 | BS |
Quantity | Value | Units | Method | Reference | Comment |
Tfus | 260.55 | K | N/A | Vorontsova and Vlasov, 1987 | Crystal phase 1 phase; Uncertainty assigned by TRC = 0.5 K; TRC |

Normal alkane RI, non-polar column, temperature ramp

Column type | Active phase | I | Reference | Comment |
---|---|---|---|---|
Capillary | OV-101 | 915. | Zenkevich, Eliseenkov, et al., 2011 | 25. m/0.20 mm/0.25 μm, Nitrogen, 6. K/min; Tstart: 40. C; Tend: 240. C |

References

Aldrich Chemical Company Inc., 1990
Aldrich Chemical Company Inc.,
Catalog Handbook of Fine Chemicals, Aldrich Chemical Company, Inc., Milwaukee WI, 1990, 1. [all data]
Vorontsova and Vlasov, 1987
Vorontsova, N.A.; Vlasov, O.N.,
Determination of saturated vapor pressure of Bayletone and its semiproducts,
Deposited Doc. ONIITEkhim Cherkassy, 1987, Doc. No. 1423 khp - 87, 1987. [all data]
Zenkevich, Eliseenkov, et al., 2011
Zenkevich, I.G.; Eliseenkov, E.V.; Kasatochkin, A.N.; Zhakovskaya, Z.A.; Khoroshko, L.O.,
Gas chromatographic identification of chlorination products of aliphatic ketones,
J. Chromatogr., 2011, 1218, 21, 3291-3299, https://doi.org/10.1016/j.chroma.2010.12.056
. [all data]