2,5-Dimethyldiphenylmethane
- Formula: C15H16
- Molecular weight: 196.2875
- IUPAC Standard InChIKey: LJBGURBFHJJQQU-UHFFFAOYSA-N
- CAS Registry Number: 13540-50-6
- Chemical structure:
View 3d structure (requires JavaScript / HTML 5) - Permanent link for this species. Use this link for bookmarking this species for future reference.

Condensed phase thermochemistry data

Data compiled by: Hussein Y. Afeefy, Joel F. Liebman, and Stephen E. Stein
Quantity | Value | Units | Method | Reference | Comment |
---|---|---|---|---|---|
ΔfH°liquid | 24.6 ± 1.4 | kJ/mol | Ccb | Good and Lee, 1976 | |
Quantity | Value | Units | Method | Reference | Comment |
ΔcH°liquid | -8213.9 ± 1.2 | kJ/mol | Ccb | Good and Lee, 1976 | Corresponding ΔfHºliquid = 24.6 kJ/mol (simple calculation by NIST; no Washburn corrections) |

Phase change data

Data compiled by: Thermodynamics Research Center, NIST Boulder Laboratories, Chris Muzny director
Quantity | Value | Units | Method | Reference | Comment |
---|---|---|---|---|---|
Tboil | 568. | K | N/A | Shima, 1930 | Uncertainty assigned by TRC = 4. K |
Tboil | 567.2 | K | N/A | Zincke, 1872 | Uncertainty assigned by TRC = 4. K |

References

Good and Lee, 1976
Good, W.D.; Lee, S.H.,
The enthalpies of formation of selected naphthalenes, diphenylmethanes, and bicyclic hydrocarbons,
J. Chem. Thermodyn., 1976, 8, 643-650. [all data]
Shima, 1930
Shima, G.,
Mem. Coll. Sci., Univ. Kyoto, Ser. A, 1930, 13, 315. [all data]
Zincke, 1872
Zincke, T.,
Chem. ber., 1872, 5, 799. [all data]