Sodium undecamer, positive ion

Reaction thermochemistry data

Data compiled by: Michael M. Meot-Ner (Mautner) and Sharon G. Lias

Individual Reactions

Na11+ + Disodium = (Na11+ • Disodium)

By formula: Na11+ + Na2 = (Na11+ • Na2)

Quantity Value Units Method Reference Comment
Δr81.2kJ/molPDissBrechignac, Cahuzac, et al., 1989gas phase

Ion clustering data

Data compiled by: Michael M. Meot-Ner (Mautner) and Sharon G. Lias

Clustering reactions

Na11+ + Disodium = (Na11+ • Disodium)

By formula: Na11+ + Na2 = (Na11+ • Na2)

Quantity Value Units Method Reference Comment
Δr81.2kJ/molPDissBrechignac, Cahuzac, et al., 1989gas phase

References

Brechignac, Cahuzac, et al., 1989
Brechignac, C.; Cahuzac, P.; Leygnier, J.; Pfalum, R.; Roux, J.P.; Weiner, J., Stability of Alkali Cluster Ions, Z. Phys. D: At. Mol. Clusters, 1989, 12, 1-4, 199, https://doi.org/10.1007/BF01426937 . [all data]