5-Amino-2,2-dimethylpentanol
- Formula: C7H17NO
- Molecular weight: 131.2160
- IUPAC Standard InChIKey: ZOOPONUAQQEUQX-UHFFFAOYSA-N
- CAS Registry Number: 13532-77-9
- Chemical structure:
View 3d structure (requires JavaScript / HTML 5) - Other names: 2,2-Dimethyl-5-amino-1-pentanol

Phase change data

Data compiled by: Robert L. Brown and Stephen E. Stein
Reduced pressure boiling point
Tboil (K) | Pressure (bar) | Reference |
---|---|---|
499. | 0.980 | Frinton Laboratories Inc., 1986 |

References

Frinton Laboratories Inc., 1986
Frinton Laboratories Inc.,
Catalog Number 11, Frinton Laboratories Inc., Vineland, NJ, 1986, 99. [all data]