Tungsten tetrafluoride oxide
- Formula: F4OW
- Molecular weight: 275.83
- CAS Registry Number: 13520-79-1

Gas phase thermochemistry data

Quantity | Value | Units | Method | Reference | Comment |
---|---|---|---|---|---|
ΔfH°gas | -319.460 | kcal/mol | Review | Chase, 1998 | Data last reviewed in December, 1971 |
Quantity | Value | Units | Method | Reference | Comment |
S°gas,1 bar | 79.995 | cal/mol*K | Review | Chase, 1998 | Data last reviewed in December, 1971 |
Gas Phase Heat Capacity (Shomate Equation)
Cp° = A + B*t + C*t2 + D*t3 +
E/t2
H° − H°298.15= A*t + B*t2/2 +
C*t3/3 + D*t4/4 − E/t + F − H
S° = A*ln(t) + B*t + C*t2/2 + D*t3/3 −
E/(2*t2) + G
Cp = heat capacity (cal/mol*K)
H° = standard enthalpy (kcal/mol)
S° = standard entropy (cal/mol*K)
t = temperature (K) / 1000.
View plot Requires a JavaScript / HTML 5 canvas capable browser.
Temperature (K) | 1000. to 6000. |
---|---|
A | 31.67189 |
B | 0.071494 |
C | -0.014894 |
D | 0.001055 |
E | -1.199060 |
F | -332.4771 |
G | 112.7430 |
H | -319.4601 |
Reference | Chase, 1998 |
Comment | Data last reviewed in December, 1971 |

Condensed phase thermochemistry data

Quantity | Value | Units | Method | Reference | Comment |
---|---|---|---|---|---|
ΔfH°liquid | -335.865 | kcal/mol | Review | Chase, 1998 | Data last reviewed in December, 1971 |
Quantity | Value | Units | Method | Reference | Comment |
S°liquid,1 bar | 42.761 | cal/mol*K | Review | Chase, 1998 | Data last reviewed in December, 1971 |
Quantity | Value | Units | Method | Reference | Comment |
ΔfH°solid | -336.260 | kcal/mol | Review | Chase, 1998 | Data last reviewed in December, 1971 |
Quantity | Value | Units | Method | Reference | Comment |
S°solid | 42.008 | cal/mol*K | Review | Chase, 1998 | Data last reviewed in December, 1971 |
Liquid Phase Heat Capacity (Shomate Equation)
Cp° = A + B*t + C*t2 + D*t3 +
E/t2
H° − H°298.15= A*t + B*t2/2 +
C*t3/3 + D*t4/4 − E/t + F − H
S° = A*ln(t) + B*t + C*t2/2 + D*t3/3 −
E/(2*t2) + G
Cp = heat capacity (cal/mol*K)
H° = standard enthalpy (kcal/mol)
S° = standard entropy (cal/mol*K)
t = temperature (K) / 1000.
View plot Requires a JavaScript / HTML 5 canvas capable browser.
Temperature (K) | 379. to 1000. |
---|---|
A | 43.50000 |
B | 3.578120×10-9 |
C | -4.182890×10-9 |
D | 1.644370×10-9 |
E | 3.042981×10-11 |
F | -348.8339 |
G | 95.40361 |
H | -335.8640 |
Reference | Chase, 1998 |
Comment | Data last reviewed in December, 1971 |
Solid Phase Heat Capacity (Shomate Equation)
Cp° = A + B*t + C*t2 + D*t3 +
E/t2
H° − H°298.15= A*t + B*t2/2 +
C*t3/3 + D*t4/4 − E/t + F − H
S° = A*ln(t) + B*t + C*t2/2 + D*t3/3 −
E/(2*t2) + G
Cp = heat capacity (cal/mol*K)
H° = standard enthalpy (kcal/mol)
S° = standard entropy (cal/mol*K)
t = temperature (K) / 1000.
View plot Requires a JavaScript / HTML 5 canvas capable browser.
Temperature (K) | 298. to 379. |
---|---|
A | -8.068841 |
B | 152.3010 |
C | -146.9850 |
D | 49.51231 |
E | 0.563715 |
F | -337.5289 |
G | -3.899250 |
H | -336.2591 |
Reference | Chase, 1998 |
Comment | Data last reviewed in December, 1971 |

References

Chase, 1998
Chase, M.W., Jr.,
NIST-JANAF Themochemical Tables, Fourth Edition,
J. Phys. Chem. Ref. Data, Monograph 9, 1998, 1-1951. [all data]