Silane, (chloromethyl)ethoxydimethyl-
- Formula: C5H13ClOSi
- Molecular weight: 152.695
- IUPAC Standard InChIKey: IGMQAYXTTRYCPZ-UHFFFAOYSA-N
- CAS Registry Number: 13508-53-7
- Chemical structure:
View 3d structure (requires JavaScript / HTML 5) - Other names: (Chloromethyl)dimethylethoxysilane; (Chloromethyl)ethoxydimethylsilane; Dimethyl-chlormethyl-ethoxysilan; Silane, (dimethyl(chloromethyl)ethoxy)-; Dimethyl(chloromethyl)ethoxysilane

Van Den Dool and Kratz RI, non-polar column, custom temperature program

Column type | Active phase | I | Reference | Comment |
---|---|---|---|---|
Capillary | VF-5MS | 848. | Tretyakov, 2011 | 30. m/0.25 mm/0.25 μm, He; Program: Multi-step temperature program; T(initial)=60C; T(final)=270C |

Normal alkane RI, non-polar column, temperature ramp

Column type | Active phase | I | Reference | Comment |
---|---|---|---|---|
Packed | SE-30 | 870. | Zenkevich, Shchegolev, et al., 1984 | Helium, Chromosorb W (80-100 mesh), 50. C @ 0. min, 5. K/min, 220. C @ 0. min; Column length: 3. m |

Normal alkane RI, non-polar column, custom temperature program

Column type | Active phase | I | Reference | Comment |
---|---|---|---|---|
Capillary | OV-101 | 873. | Zenkevich and Malamakhov, 1987 | He; Column length: 50. m; Column diameter: 0.24 mm; Program: not specified |

References

Tretyakov, 2011
Tretyakov, K.V.,
Retention Data. NIST Mass Spectrometry Data Center., NIST Mass Spectrometry Data Center, 2011. [all data]
Zenkevich, Shchegolev, et al., 1984
Zenkevich, I.G.; Shchegolev, A.E.; Finogenov, Yu.; Ivin B.A.,
Mass Spectrometric Characterization of Alkyl- and Alkoxy(chlormethyl)silanes, VINITI, # 6805-84, 1984, 29. [all data]
Zenkevich and Malamakhov, 1987
Zenkevich, I.G.; Malamakhov, A.C.,
Evaluation of Molecular Weights of Organic Compounds based on Retention Parameters at Chromato-Spectral Analysys. Additional Criterion of Molecular Ions' Identification,
Vestn. St. Petersb. Univ. Ser. 4: Fiz. Khim, 1987, 2, 101-106. [all data]