3,5-Dimethyl-1,2-cyclopentanedione
- Formula: C7H10O2
- Molecular weight: 126.1531
- IUPAC Standard InChIKey: MIDXCONKKJTLDX-UHFFFAOYSA-N
- CAS Registry Number: 13494-07-0
- Chemical structure:
View 3d structure (requires JavaScript / HTML 5) - Other names: 1,2-Cyclopentanedione, 3,5-dimethyl-; 3,5-dimethylcyclopentane-1,2-dione

Van Den Dool and Kratz RI, non-polar column, temperature ramp

Column type | Active phase | I | Reference | Comment |
---|---|---|---|---|
Capillary | OV-101 | 1044. | Mihara and Nishimura, 1989 | N2, 2. K/min; Column length: 50. m; Column diameter: 0.22 mm; Tstart: 80. C; Tend: 200. C |

Normal alkane RI, polar column, custom temperature program

Column type | Active phase | I | Reference | Comment |
---|---|---|---|---|
Capillary | SOLGel-Wax | 1780. | Shu and Shen, 2008 | 30. m/0.53 mm/0.50 μm, Helium; Program: 40 0C 7 0C/min -> 180 0C 10 0C/min -> 240 0C (10 min) |
Capillary | SOLGel-Wax | 1769. | Shu and Shen, 2008 | 30. m/0.53 mm/0.50 μm, Helium; Program: not specified |

References

Mihara and Nishimura, 1989
Mihara, S.; Nishimura, O.,
Retention indices of 2-hydroxy-2-cyclopenten-1-ones,
J. Hi. Res. Chromatogr., 1989, 12, 11, 763-764, https://doi.org/10.1002/jhrc.1240121116
. [all data]
Shu and Shen, 2008
Shu, N.; Shen, H.,
Aroma-impact compounds in Lysimachia foenum-graecum extracts,
Flavour Fragr. J., 2008, 24, 1, 1-6, https://doi.org/10.1002/ffj.1908
. [all data]