CAS Reg. No. 13479-16-8
- CAS Registry Number: 13479-16-8

Reaction thermochemistry data

Data compiled by: John E. Bartmess
Individual Reactions
CAS Reg. No. 13479-16-8 + 3 = C9H20O7-2
By formula: CAS Reg. No. 13479-16-8 + 3H2O = C9H20O7-2
Quantity | Value | Units | Method | Reference | Comment |
---|---|---|---|---|---|
ΔrG° | 7.60 ± 0.30 | kcal/mol | TDAs | Blades, Klassen, et al., 1995 | gas phase |

References

Blades, Klassen, et al., 1995
Blades, A.T.; Klassen, J.S.; Kebarle, P.,
Free Energies of Hydration in the Gas Phase on the Anions of Some Oxo Acids of C, N, S, P, Cl and I,
J. Am. Chem. Soc., 1995, 117, 42, 10563, https://doi.org/10.1021/ja00147a019
. [all data]