Chromium(II) iodide

Phase change data

Data compiled by: William E. Acree, Jr., James S. Chickos

Quantity Value Units Method Reference Comment
Δsub298.7kJ/molN/AAllen, 1956Based on data from 943. - 1054. K.

References

Allen, 1956
Allen, Thomas L., The Vapor Pressure and Heat of Sublimation of Chromous Iodide. The Chromium-Iodine Bond Energy in Chromous Iodide *, J. Am. Chem. Soc., 1956, 78, 21, 5476-5478, https://doi.org/10.1021/ja01602a004 . [all data]