Pentane, 2,4-dimethyl-3-(1-methylethyl)-

Phase change data

Data compiled as indicated in comments:
TRC - Thermodynamics Research Center, NIST Boulder Laboratories, Chris Muzny director
AC - William E. Acree, Jr., James S. Chickos

Quantity Value Units Method Reference Comment
Tboil430.19KN/AHoward, Mears, et al., 1947Uncertainty assigned by TRC = 0.1 K; TRC
Quantity Value Units Method Reference Comment
Tfus191.4KN/AHoward, Mears, et al., 1947Uncertainty assigned by TRC = 0.1 K; TRC
Quantity Value Units Method Reference Comment
Δvap45.6kJ/molN/AReid, 1972AC

In addition to the Thermodynamics Research Center (TRC) data available from this site, much more physical and chemical property data is available from the following TRC products:

References

Howard, Mears, et al., 1947
Howard, F.L.; Mears, T.W.; Fookson, A.; Pomerantz, P.; Brooks, D.B., Preparation and physical properties of several aliphatic hydrocarbons and intermediates, J. Res. Natl. Bur. Stand. (U. S.), 1947, 38, 365. [all data]

Reid, 1972
Reid, Robert C., Handbook on vapor pressure and heats of vaporization of hydrocarbons and related compounds, R. C. Wilhort and B. J. Zwolinski, Texas A Research Foundation. College Station, Texas(1971). 329 pages.$10.00, AIChE J., 1972, 18, 6, 1278-1278, https://doi.org/10.1002/aic.690180637 . [all data]