Heptane, 5-ethyl-2-methyl-
- Formula: C10H22
- Molecular weight: 142.2817
- IUPAC Standard InChIKey: DGEMPTLPTFNEHJ-UHFFFAOYSA-N
- CAS Registry Number: 13475-78-0
- Chemical structure:
View 3d structure (requires JavaScript / HTML 5) - Other names: 5-Ethyl-2-methylheptane; Heptane, 3-ethyl-6-methyl; 2-Methyl-5-ethylheptane

Phase change data

Data compiled by: William E. Acree, Jr., James S. Chickos
Quantity | Value | Units | Method | Reference | Comment |
---|---|---|---|---|---|
ΔvapH° | 48.1 | kJ/mol | N/A | Reid, 1972 |

Normal alkane RI, non-polar column, custom temperature program

Data compiled by: NIST Mass Spectrometry Data Center, William E. Wallace, director

Column type CapillaryCapillaryCapillary
Active phase OV-101Polydimethyl siloxaneSqualane
Column length (m)
Carrier gas
Substrate
Column diameter (mm)
Phase thickness (μm)
Program not specifiednot specifiednot specified
I 924.925.925.
ReferenceDu and Liang, 2003Junkes, Castanho, et al., 2003Petrov, 1984
Comment MSDC-RI MSDC-RI MSDC-RI

Henry's Law data

Data compiled by: Rolf Sander

Henry's Law constant (water solution)

kH(T) = H exp(d(ln(kH))/d(1/T) ((1/T) - 1/(298.15 K)))
H = Henry's law constant for solubility in water at 298.15 K (mol/(kg*bar))
d(ln(kH))/d(1/T) = Temperature dependence constant (K)

H (mol/(kg*bar)) d(ln(kH))/d(1/T) (K) Method Reference Comment
0.00016 QN/A missing citation give several references for the Henry's law constants but don't assign them to specific species.

References

Reid, 1972
Reid, Robert C.,
Handbook on vapor pressure and heats of vaporization of hydrocarbons and related compounds, R. C. Wilhort and B. J. Zwolinski, Texas A Research Foundation. College Station, Texas(1971). 329 pages.$10.00,
AIChE J., 1972, 18, 6, 1278-1278, https://doi.org/10.1002/aic.690180637
. [all data]