Eicosane, 9-octyl-
- Formula: C28H58
- Molecular weight: 394.7601
- IUPAC Standard InChIKey: JNRMADFNKDCLKT-UHFFFAOYSA-N
- CAS Registry Number: 13475-77-9
- Chemical structure:
View 3d structure (requires JavaScript / HTML 5) - Other names: 9-n-Octyleicosane; 9-Octyleicosane

Phase change data

Data compiled as indicated in comments:
TRC - Thermodynamics Research Center, NIST Boulder Laboratories, Chris Muzny director
AC - William E. Acree, Jr., James S. Chickos
Quantity | Value | Units | Method | Reference | Comment |
---|---|---|---|---|---|
Tfus | 273.7 | K | N/A | Foehr and Fenske, 1949 | Uncertainty assigned by TRC = 2. K; TRC |
Tfus | 273.7 | K | N/A | Schiessler, 1947 | Uncertainty assigned by TRC = 1. K; TRC |
Enthalpy of vaporization
ΔvapH (kJ/mol) | Temperature (K) | Method | Reference | Comment |
---|---|---|---|---|
106.8 | 475. | A | Stephenson and Malanowski, 1987 | Based on data from 460. to 530. K.; AC |

References

Foehr and Fenske, 1949
Foehr, E.G.; Fenske, M.R.,
Magneto-optic Rotation of Hydrocarbons,
Ind. Eng. Chem., 1949, 41, 1956. [all data]
Schiessler, 1947
Schiessler, R.W.,
, Am. Pet. Inst. Res. Proj. 42, Twelfth Meeting, 1947. [all data]
Stephenson and Malanowski, 1987
Stephenson, Richard M.; Malanowski, Stanislaw,
Handbook of the Thermodynamics of Organic Compounds, 1987, https://doi.org/10.1007/978-94-009-3173-2
. [all data]