Docosane, 11-butyl-
- Formula: C26H54
- Molecular weight: 366.7070
- IUPAC Standard InChIKey: HEUYLTACOIADBB-UHFFFAOYSA-N
- CAS Registry Number: 13475-76-8
- Chemical structure:
View 3d structure (requires JavaScript / HTML 5) - Other names: 11-Butyldocosane; Hexadecane, 5-decyl; 11-n-Butyldocosane

Gas phase thermochemistry data

Data compiled by: Hussein Y. Afeefy, Joel F. Liebman, and Stephen E. Stein
Quantity | Value | Units | Method | Reference | Comment |
---|---|---|---|---|---|
ΔfH°gas | -593.3 ± 7.5 | kJ/mol | Ccb | Knowlton and Huffman, 1944 | Heat of vaporization estimated by Cox and Pilcher, 1970 |

Condensed phase thermochemistry data

Data compiled by: Hussein Y. Afeefy, Joel F. Liebman, and Stephen E. Stein
Quantity | Value | Units | Method | Reference | Comment |
---|---|---|---|---|---|
ΔfH°liquid | -717.6 | kJ/mol | Ccb | Knowlton and Huffman, 1944 | |
Quantity | Value | Units | Method | Reference | Comment |
ΔcH°liquid | -17232.6 ± 6.7 | kJ/mol | Ccb | Knowlton and Huffman, 1944 | Reanalyzed by Cox and Pilcher, 1970, Original value = -17231. kJ/mol; Corresponding ΔfHºliquid = -716.05 kJ/mol (simple calculation by NIST; no Washburn corrections) |

Phase change data

Data compiled as indicated in comments:
BS - Robert L. Brown and Stephen E. Stein
TRC - Thermodynamics Research Center, NIST Boulder Laboratories, Chris Muzny director
ALS - Hussein Y. Afeefy, Joel F. Liebman, and Stephen E. Stein
AC - William E. Acree, Jr., James S. Chickos
Quantity | Value | Units | Method | Reference | Comment |
---|---|---|---|---|---|
Tfus | 273.15 | K | N/A | Anonymous, 1968 | TRC |
Tfus | 273.2 | K | N/A | Schiessler, 1947 | Uncertainty assigned by TRC = 1. K; TRC |
Tfus | 273.2 | K | N/A | Whitmore, Sutherland, et al., 1942 | Uncertainty assigned by TRC = 1. K; TRC |
Quantity | Value | Units | Method | Reference | Comment |
ΔvapH° | 123. ± 0.8 | kJ/mol | E | Knowlton and Huffman, 1944 | Heat of vaporization estimated by Cox and Pilcher, 1970; ALS |
Reduced pressure boiling point
Tboil (K) | Pressure (bar) | Reference | Comment |
---|---|---|---|
515.7 | 0.013 | Weast and Grasselli, 1989 | BS |
Enthalpy of vaporization
ΔvapH (kJ/mol) | Temperature (K) | Method | Reference | Comment |
---|---|---|---|---|
93.3 | 495. | A,MG | Stephenson and Malanowski, 1987 | Based on data from 480. to 516. K. See also Schiessler and Whitmore, 1955.; AC |

References

Knowlton and Huffman, 1944
Knowlton, J.W.; Huffman, H.M.,
The heats of combustion of some substituted eicosanes, heneicosanes and docosanes,
J. Am. Chem. Soc., 1944, 66, 1492-1494. [all data]
Cox and Pilcher, 1970
Cox, J.D.; Pilcher, G.,
Thermochemistry of Organic and Organometallic Compounds, Academic Press, New York, 1970, 1-636. [all data]
Anonymous, 1968
Anonymous, R.,
Properties of hydrocarbon of high molecular weight, Am. Pet. Inst. Res. Proj. 42, Penn. State Univ., 1968. [all data]
Schiessler, 1947
Schiessler, R.W.,
, Am. Pet. Inst. Res. Proj. 42, Twelfth Meeting, 1947. [all data]
Whitmore, Sutherland, et al., 1942
Whitmore, F.C.; Sutherland, L.H.; Cosby, J.N.,
Higher Hydrocarbons. I. Seven Alkyl Substituted Docosanes.,
J. Am. Chem. Soc., 1942, 64, 1360. [all data]
Weast and Grasselli, 1989
CRC Handbook of Data on Organic Compounds, 2nd Editon, Weast,R.C and Grasselli, J.G., ed(s)., CRC Press, Inc., Boca Raton, FL, 1989, 1. [all data]
Stephenson and Malanowski, 1987
Stephenson, Richard M.; Malanowski, Stanislaw,
Handbook of the Thermodynamics of Organic Compounds, 1987, https://doi.org/10.1007/978-94-009-3173-2
. [all data]
Schiessler and Whitmore, 1955
Schiessler, R.W.; Whitmore, F.C.,
Properties of High Molecular Weight Hydrocarbons,
Ind. Eng. Chem., 1955, 47, 8, 1660-1665, https://doi.org/10.1021/ie50548a054
. [all data]