didocosyl succinate

Phase change data

Data compiled by: Thermodynamics Research Center, NIST Boulder Laboratories, Chris Muzny director

Quantity Value Units Method Reference Comment
Tfus352.95KN/AMcGee, Crimi, et al., 1962Uncertainty assigned by TRC = 1.5 K

In addition to the Thermodynamics Research Center (TRC) data available from this site, much more physical and chemical property data is available from the following TRC products:

References

McGee, Crimi, et al., 1962
McGee, H.L.; Crimi, J.S.; Schwartz, P.M., Some Physical Properties of Long-Chained Esters of Dibasic Acids, J. Chem. Eng. Data, 1962, 7, 102. [all data]