trans-α-Bergamotene
- Formula: C15H24
- Molecular weight: 204.3511
- IUPAC Standard InChIKey: YMBFCQPIMVLNIU-UHFFFAOYSA-N
- CAS Registry Number: 13474-59-4
- Chemical structure:
View 3d structure (requires JavaScript / HTML 5) - Species with the same structure:
- Stereoisomers:
- Other names: 2,6-Dimethyl-6-(4-methyl-3-pentenyl)bicyclo[3.1.1]hept-2-ene; α-trans-Bergamotene; (E)-α-Bergamotene; α-E-Bergamotene; trans-Bergamotene; (E)-α-2,6-dimethyl-6-(4-methylpent-3-enyl)bicyclo[3.1.1]- hept-2-ene ((E)-α-bergamotene); α-trans-Bergamoptene; Bergamotene (α-trans); trans-α-bergamottene; Bicyclo[3.1.1]hept-2-ene, 2,6-dimethyl-6-(4-methyl-3-penten-1-yl)-, (1S,5S,6R)-

Kovats' RI, non-polar column, isothermal

Column type | Active phase | Temperature (C) | I | Reference | Comment |
---|---|---|---|---|---|
Capillary | EC-1 | 130. | 1431. | Szafranek, Chrapkowska, et al., 2005 | 30. m/0.25 mm/0.25 μm |

Kovats' RI, non-polar column, temperature ramp

Column type | Active phase | I | Reference | Comment |
---|---|---|---|---|
Capillary | HP-5MS | 1438. | Hazzit, Baaliouamer, et al., 2006 | 30. m/0.25 mm/0.25 μm, He, 60. C @ 8. min, 2. K/min, 280. C @ 30. min |
Capillary | DB-5 | 1438. | Lucero, Fredrickson, et al., 2006 | 30. m/0.25 mm/0.25 μm, He, 3. K/min; Tstart: 60. C |
Capillary | BP-1 | 1432. | Raina, Verma, et al., 2006 | 25. m/0.32 mm/0.25 μm, N2, 5. K/min, 220. C @ 13. min; Tstart: 60. C |
Capillary | HP-5MS | 1439. | Asuming, Beauchamp, et al., 2005 | 30. m/0.25 mm/0.25 μm, He, 50. C @ 10. min, 3. K/min, 250. C @ 5. min |
Capillary | DB-5 | 1436. | Barbosa, Paula, et al., 2005 | 30. m/0.25 mm/0.25 μm, He, 3. K/min, 240. C @ 15. min; Tstart: 60. C |
Capillary | DB-5 | 1437. | Medina, Lucero, et al., 2005 | 30. m/0.25 mm/0.25 μm, Helium, 3. K/min; Tstart: 60. C; Tend: 255. C |
Capillary | HP-5 | 1450. | Bouzouita, Kachouri, et al., 2003 | 30. m/0.25 mm/1. μm, He, 40. C @ 1. min, 5. K/min; Tend: 250. C |
Capillary | DB-5 | 1437. | Lucero, Estell, et al., 2003 | 30. m/0.25 mm/0.25 μm, He, 3. K/min; Tstart: 60. C |
Capillary | DB-5 | 1436. | Viña and Murillo, 2003 | 30. m/0.25 mm/0.25 μm, He, 50. C @ 5. min, 0.5 K/min, 250. C @ 10. min |
Capillary | DB-5 | 1452. | Buchin, Salmon, et al., 2002 | 60. m/0.32 mm/1. μm, He, 40. C @ 5. min, 3. K/min, 230. C @ 2. min |
Capillary | HP-5MS | 1436. | Salido, Altarejos, et al., 2002 | 30. m/0.25 mm/0.25 μm, He, 3. K/min; Tstart: 50. C; Tend: 250. C |
Capillary | DB-1 | 1434. | Thangadurai, Anitha, et al., 2002 | 28. m/0.25 mm/0.25 μm, He, 50. C @ 1. min, 5.5 K/min; Tend: 270. C |
Capillary | DB-1 | 1443. | Senatore and Rigano, 2001 | 30. m/0.25 mm/0.25 μm, He, 40. C @ 5. min, 2. K/min, 260. C @ 20. min |
Capillary | Methyl Silicone | 1424. | Jayaprakasha, Rao, et al., 2000 | 30. m/0.32 mm/0.25 μm, He, 60. C @ 2. min, 2. K/min, 225. C @ 5. min |
Capillary | HP-5MS | 1436. | Roussis, Tsoukatou, et al., 2000 | 30. m/0.25 mm/0.25 μm, He, 3. K/min; Tstart: 60. C; Tend: 280. C |
Capillary | BP-5 | 1437. | Weissbecker B., Van Loon J.J.A., et al., 2000 | 25. m/0.25 mm/0.25 μm, He, 3. K/min; Tstart: 60. C; Tend: 200. C |
Capillary | CP Sil 5 CB | 1434. | Kaul, Gujral, et al., 1999 | He, 5. K/min; Column length: 25. m; Column diameter: 0.25 mm; Tstart: 60. C; Tend: 280. C |
Capillary | HP-5 | 1434. | Sajjadi and Ghassemi, 1999 | 30. m/0.25 mm/0.25 μm, He, 4. K/min; Tstart: 60. C; Tend: 280. C |
Capillary | DB-5 | 1434. | da Silva, Zoghbi, et al., 1999 | 30. m/0.25 mm/0.25 μm, He, 4. K/min; Tstart: 60. C; Tend: 240. C |
Capillary | Methyl Silicone | 1435. | Mallavarapu, Rao, et al., 1998 | N2, 5. K/min; Column length: 25. m; Column diameter: 0.5 mm; Tstart: 60. C; Tend: 220. C |
Capillary | BP-1 | 1422. | Ekundayo, Laakso, et al., 1988 | H2, 65. C @ 2. min, 5. K/min; Column length: 50. m; Column diameter: 0.33 mm; Tend: 220. C |

Kovats' RI, non-polar column, custom temperature program

Column type | Active phase | I | Reference | Comment |
---|---|---|---|---|
Capillary | BP-1 | 1434. | Khan, Verma, et al., 2006 | 30. m/0.32 mm/0.25 μm, N2; Program: 60C => 5C/min => 220C (5min) => 3C/min => 245C(5min) |
Capillary | HP-5 | 1436. | Shellie and Marriott, 2003 | 30. m/0.25 mm/0.25 μm, He; Program: not specified |
Capillary | HP-5 | 1438. | Novak, Zitterl-Eglseer, et al., 2001 | 30. m/0.25 mm/0.25 μm, He; Program: 50 0C 5 K/min -> 140 0C 2 K/min -> 170 0C |
Capillary | DB-5MS | 1437. | Maia, Andrade, et al., 2000 | 30. m/0.25 mm/0.25 μm, He; Program: 40C => 2C/min => 60C => 4C/min => 260C |
Capillary | DB-5 | 1431. | Santos, Andrade, et al., 1998 | 30. m/0.25 mm/0.25 μm, He; Program: 40C => 2C/min => 60C => 4C/min => 240C |

Kovats' RI, polar column, temperature ramp

Column type | Active phase | I | Reference | Comment |
---|---|---|---|---|
Capillary | Innowax | 1536. | Viña and Murillo, 2003 | 30. m/0.25 mm/0.25 μm, He, 50. C @ 5. min, 0.5 K/min, 250. C @ 10. min |
Capillary | Carbowax 20M | 1590. | Mallavarapu, Rao, et al., 1998 | N2, 5. K/min; Column length: 25. m; Column diameter: 0.5 mm; Tstart: 60. C; Tend: 200. C |
Capillary | Carbowax 20M | 1584. | Tressl, Friese, et al., 1978 | He, 2. K/min; Column length: 50. m; Column diameter: 0.28 mm; Tstart: 70. C; Tend: 190. C |

Van Den Dool and Kratz RI, non-polar column, temperature ramp

Column type | Active phase | I | Reference | Comment |
---|---|---|---|---|
Capillary | HP-5MS | 1441. | Benkaci-Ali, Baaliouamer, et al., 2007 | 30. m/0.25 mm/0.25 μm, He, 60. C @ 8. min, 2. K/min, 250. C @ 30. min |
Capillary | BP-1 | 1433. | Boti, Koukoua, et al., 2007 | 50. m/0.22 mm/0.25 μm, He, 2. K/min, 220. C @ 20. min; Tstart: 60. C |
Capillary | HP-5 | 1436. | Flamini, Tebano, et al., 2007 | 30. m/0.25 mm/0.25 μm, N2, 50. C @ 10. min, 5. K/min; Tend: 220. C |
Capillary | DB-5 | 1434. | Martins, Santos, et al., 2007 | 30. m/0.22 mm/0.25 μm, 60. C @ 2. min, 3. K/min; Tend: 240. C |
Capillary | RTX-1 | 1430. | Paolini J., Costa J., et al., 2007 | 60. m/0.22 mm/0.25 μm, He, 2. K/min, 230. C @ 35. min; Tstart: 60. C |
Capillary | RTX-1 | 1430. | Paolini, Muselli, et al., 2007 | 60. m/0.22 mm/0.25 μm, He, 2. K/min, 230. C @ 35. min; Tstart: 60. C |
Capillary | HP-5 | 1439. | Quijano, Salamanca, et al., 2007 | 30. m/0.25 mm/0.25 μm, He, 50. C @ 4. min, 4. K/min, 250. C @ 10. min |
Capillary | DB-5 | 1441. | Sabulal, Dan, et al., 2007 | 30. m/0.25 mm/0.25 μm, He, 5. K/min; Tstart: 60. C; Tend: 260. C |
Capillary | DB-1 | 1438. | Sonboli, Azizian, et al., 2007 | 60. m/0.25 mm/0.25 μm, N2, 5. K/min, 250. C @ 10. min; Tstart: 60. C |
Capillary | SPB-1 | 1424. | Blagojevic, Radulovic, et al., 2006 | 30. m/0.25 mm/0.25 μm, He, 50. C @ 3. min, 5. K/min, 250. C @ 15. min |
Capillary | DB-5 | 1426. | Blagojevic, Radulovic, et al., 2006 | 30. m/0.2 mm/0.25 μm, He, 50. C @ 3. min, 5. K/min, 250. C @ 15. min |
Capillary | RTX-1 | 1433. | Cavalli, Tomi, et al., 2006 | 60. m/0.22 mm/0.25 μm, He, 2. K/min, 230. C @ 45. min; Tstart: 60. C |
Capillary | DB-5 | 1435. | Dob, Dahmane, et al., 2006 | 30. m/0.25 mm/0.25 μm, N2, 60. C @ 3. min, 3. K/min, 240. C @ 3. min |
Capillary | HP-5 | 1437. | Flamini, Tebano, et al., 2006 | 30. m/0.25 mm/0.25 μm, N2, 60. C @ 10. min, 5. K/min; Tend: 220. C |
Capillary | RTX-1 | 1429. | Paolini J., Desjobert J.M., et al., 2006 | 60. m/0.22 mm/0.25 μm, He, 2. K/min, 230. C @ 35. min; Tstart: 60. C |
Capillary | SPB-1 | 1427. | Pinto, Pina-Vaz, et al., 2006 | 30. m/0.2 mm/0.2 μm, He, 3. K/min, 220. C @ 15. min; Tstart: 70. C |
Capillary | SPB-1 | 1430. | Radulovic, Mananjarasoa, et al., 2006 | 30. m/0.25 mm/0.25 μm, He, 50. C @ 3. min, 5. K/min, 250. C @ 15. min |
Capillary | OV-1 | 1438. | Rubiolo P., Matteodo M., et al., 2006 | 25. m/0.25 mm/0.25 μm, He, 50. C @ 1. min, 3. K/min, 220. C @ 5. min |
Capillary | HP-5MS | 1438. | Saroglou, Dorizas, et al., 2006 | 30. m/0.25 mm/0.25 μm, He, 60. C @ 5. min, 4. K/min; Tend: 280. C |
Capillary | HP-5 | 1433. | Vundac, Pfeifhofer, et al., 2006 | 30. m/0.25 mm/0.25 μm, He, 40. C @ 5. min, 4. K/min; Tend: 300. C |
Capillary | CP Sil 5 CB | 1430. | Ziegenbein, Hanssen, et al., 2006 | H2, 10. K/min; Column length: 25. m; Column diameter: 0.25 mm; Tstart: 80. C; Tend: 270. C |
Capillary | BP-1 | 1433. | Boti J.B., Koukoua G., et al., 2005 | 50. m/0.22 mm/0.25 μm, He, 2. K/min, 220. C @ 20. min; Tstart: 60. C |
Capillary | RTX-1 | 1433. | Cozzani, Muselli, et al., 2005 | 60. m/0.22 mm/0.25 μm, 2. K/min, 220. C @ 20. min; Tstart: 60. C |
Capillary | DB-1 | 1427. | Dob, Berramdane, et al., 2005 | 30. m/0.32 mm/0.25 μm, N2, 50. C @ 3. min, 2. K/min, 260. C @ 5. min |
Capillary | DB-1 | 1420. | Fanciullino, Gancel, et al., 2005 | 30. m/0.25 mm/0.25 μm, He, 3. K/min, 250. C @ 20. min; Tstart: 40. C |
Capillary | HP-5 | 1436. | Flamini, Luigi Cioni, et al., 2005 | 30. m/0.25 mm/0.25 μm, N2, 60. C @ 10. min, 5. K/min; Tend: 220. C |
Capillary | DB-1 | 1414. | Gancel, Ollitrault, et al., 2005 | 30. m/0.25 mm/0.25 μm, He, 3. K/min, 250. C @ 20. min; Tstart: 40. C |
Capillary | DB-1 | 1435. | bin Jantan, Yalvema, et al., 2005 | 25. m/0.25 mm/0.25 μm, 60. C @ 10. min, 3. K/min, 180. C @ 10. min |
Capillary | RTX-1 | 1430. | Paolini, Costa, et al., 2005 | 60. m/0.22 mm/0.25 μm, He, 2. K/min, 230. C @ 35. min; Tstart: 60. C |
Capillary | HP-5MS | 1436. | Pino, Mesa, et al., 2005 | 30. m/0.25 mm/0.25 μm, He, 60. C @ 2. min, 4. K/min, 250. C @ 20. min |
Capillary | DB-5 | 1423. | Sati and Mathela, 2005 | 30. m/0.25 mm/0.26 μm, He, 3. K/min; Tstart: 60. C; Tend: 210. C |
Capillary | HP-5MS | 1427. | Smadja, Rondeau, et al., 2005 | 60. m/0.2 mm/0.25 μm, He, 2. K/min, 200. C @ 10. min; Tstart: 60. C |
Capillary | DB-1 | 1425. | Tchoumbougnang, Zollo, et al., 2005 | 30. m/0.25 mm/0.25 μm, N2, 5. K/min; Tstart: 50. C; Tend: 200. C |
Capillary | Mega 5MS | 1427. | Verzera, Trozzi, et al., 2005 | 30. m/0.25 mm/0.25 μm, He, 40. C @ 2. min, 3. K/min; Tend: 240. C |
Capillary | HP-5MS | 1433. | Aligiannis, Kalpoutzakis, et al., 2004 | 30. m/0.25 mm/0.25 μm, He, 3. K/min; Tstart: 60. C; Tend: 280. C |
Capillary | SPB-1 | 1428. | Antunes, Sevinate-Pinto, et al., 2004 | 30. m/0.25 mm/0.25 μm, He, 3. K/min, 220. C @ 15. min; Tstart: 70. C |
Capillary | HP-5 | 1441. | Ceccarini, Macchia, et al., 2004 | 30. m/0.25 mm/0.25 μm, 60. C @ 10. min, 5. K/min; Tend: 220. C |
Capillary | RTX-5 | 1436. | Dugo, Mondello, et al., 2004 | 30. m/0.25 mm/0.25 μm, He, 45. C @ 6. min, 3. K/min, 300. C @ 10. min |
Capillary | BP-1 | 1433. | Gonny, Bradesi, et al., 2004 | 50. m/0.22 mm/0.25 μm, 2. K/min, 220. C @ 20. min; Tstart: 60. C |
Capillary | HP-5MS | 1434. | Grujic-Jovanovic, Skaltsa, et al., 2004 | 30. m/0.25 mm/0.25 μm, He, 60. C @ 5. min, 4. K/min; Tend: 280. C |
Capillary | RSL-200 | 1452. | Ngassoum, Ousmaila, et al., 2004 | 30. m/0.32 mm/0.25 μm, H2, 40. C @ 5. min, 6. K/min, 280. C @ 5. min |
Capillary | HP-5 | 1436. | Stashenko, Jaramillo, et al., 2004 | 50. m/0.2 mm/0.2 μm, He, 40. C @ 15. min, 3. K/min, 250. C @ 40. min |
Capillary | HP-5MS | 1414. | Tzakou, Vagias, et al., 2004 | 30. m/0.25 mm/0.25 μm, He, 3. K/min; Tstart: 60. C; Tend: 280. C |
Capillary | DB-5 | 1439. | bin Ahmad and bin Jantan, 2003 | 25. m/0.25 mm/0.25 μm, N2, 75. C @ 10. min, 3. K/min, 210. C @ 1. min |
Capillary | BPX-5 | 1436. | bin Ahmad and bin Jantan, 2003, 2 | 30. m/0.25 mm/0.25 μm, N2, 75. C @ 10. min, 3. K/min, 210. C @ 1. min |
Capillary | DB-5 | 1441. | Bader, Caponi, et al., 2003 | 30. m/0.25 mm/0.25 μm, He, 3. K/min, 240. C @ 30. min; Tstart: 60. C |
Capillary | BP-1 | 1435. | Bianchini, Tomi, et al., 2003 | 50. m/0.22 mm/0.25 μm, He, 2. K/min, 230. C @ 35. min; Tstart: 60. C |
Capillary | HP-5 | 1436. | Bougatsos, Meyer, et al., 2003 | 30. m/0.25 mm/0.25 μm, He, 3. K/min; Tstart: 60. C; Tend: 280. C |
Capillary | RTX-1 | 1432. | Cavalli, Tomi, et al., 2003 | 60. m/0.22 mm/0.25 μm, He, 2. K/min, 230. C @ 45. min; Tstart: 60. C |
Capillary | Ultra-2 | 1438. | Ceva-Antunes, Bizzo, et al., 2003 | 25. m/0.25 mm/0.33 μm, H2, 40. C @ 2. min, 3. K/min, 280. C @ 10. min |
Capillary | HP-5 | 1440. | Ertugrul, Dural, et al., 2003 | 30. m/0.25 mm/0.25 μm, N2, 60. C @ 10. min, 5. K/min; Tend: 220. C |
Capillary | DB-1 | 1414. | Gancel, Ollitrault, et al., 2003 | 30. m/0.25 mm/0.25 μm, He, 3. K/min, 250. C @ 20. min; Tstart: 40. C |
Capillary | MS5 | 1431. | Shao, Marriott, et al., 2003 | 25. m/0.25 mm/0.25 μm, 3. K/min; Tstart: 40. C; Tend: 180. C |
Capillary | HP-5 | 1433. | Shellie and Marriott, 2003 | 30. m/0.25 mm/0.25 μm, He, 3. K/min; Tstart: 40. C; Tend: 240. C |
Capillary | HP-5 | 1434. | Skaltsa, Demetzos, et al., 2003 | 30. m/0.25 mm/0.25 μm, He, 60. C @ 5. min, 4. K/min; Tend: 280. C |
Capillary | HP-5 | 1437. | Tzakou, Couladis, et al., 2003 | 30. m/0.25 mm/0.25 μm, He, 3. K/min; Tstart: 60. C; Tend: 280. C |
Capillary | Mega 5MS | 1427. | Verzera, Trozzi, et al., 2003 | 30. m/0.25 mm/0.25 μm, He, 40. C @ 2. min, 3. K/min; Tend: 240. C |
Capillary | DB-5 | 1441. | Flamini, Cioni, et al., 2002 | 30. m/0.25 mm/0.25 μm, He, 3. K/min; Tstart: 60. C; Tend: 240. C |
Capillary | CP Sil 5 CB | 1435. | Heinrich, Pfeifhofer, et al., 2002 | 50. m/0.25 mm/0.15 μm, H2, 40. C @ 3. min, 4. K/min; Tend: 300. C |
Capillary | DB-1 | 1430. | bin Jantan and bin Ahmad, 2002 | N2, 60. C @ 10. min, 3. K/min, 180. C @ 10. min; Column length: 25. m; Column diameter: 0.25 mm |
Capillary | BP-1 | 1432. | Lota, de Rocca Serra, et al., 2002 | 50. m/0.22 mm/0.25 μm, He, 2. K/min, 220. C @ 20. min; Tstart: 60. C |
Capillary | RTX-5 | 1439. | Mondello, Zappia, et al., 2002 | 30. m/0.25 mm/0.25 μm, He, 45. C @ 6. min, 3. K/min, 300. C @ 10. min |
Capillary | HP-1 | 1429. | Nath, Sarma, et al., 2002 | 24. m/0.32 mm/0.17 μm, He, 60. C @ 2. min, 4. K/min, 250. C @ 20. min |
Capillary | HP-5 | 1405. | Pitarokili, Couladis, et al., 2002 | 30. m/0.25 mm/0.25 μm, He, 3. K/min; Tstart: 60. C; Tend: 280. C |
Capillary | RTX-5 | 1436. | Shellie, Mondello, et al., 2002 | 30. m/0.25 mm/0.25 μm, He, 45. C @ 6. min, 3. K/min; Tend: 250. C |
Capillary | RTX-5 | 1440. | Shellie, Mondello, et al., 2002 | 30. m/0.25 mm/0.25 μm, He, 45. C @ 6. min, 3. K/min; Tend: 250. C |
Capillary | HP-5 | 1432. | Aligiannis, Kalpoutzakis, et al., 2001 | 30. m/0.25 mm/0.25 μm, He, 60. C @ 5. min, 3. K/min; Tend: 280. C |
Capillary | BP-1 | 1435. | Bianchini, Tomi, et al., 2001 | 50. m/0.22 mm/0.25 μm, He, 2. K/min, 230. C @ 35. min; Tstart: 60. C |
Capillary | DB-5 | 1439. | Bortolomeazzi, Berno, et al., 2001 | 30. m/0.25 mm/0.25 μm, He, 60. C @ 3. min, 5. K/min; Tend: 300. C |
Capillary | BP-1 | 1432. | Lota, Serra, et al., 2001 | 50. m/0.22 mm/0.25 μm, He, 2. K/min; Tstart: 60. C; Tend: 220. C |
Capillary | HP-5MS | 1434. | Skaltsa, Mavrommati, et al., 2001 | 30. m/0.25 mm/0.25 μm, He, 60. C @ 5. min, 4. K/min; Tend: 280. C |
Capillary | DB-5 | 1439. | Bortolomeazzi, Pizzale, et al., 2000 | 30. m/0.25 mm/0.25 μm, He, 60. C @ 3. min, 5. K/min; Tend: 300. C |
Capillary | RTX-5 | 1443. | Mondello, Zappia, et al., 2000 | 10. m/0.1 mm/0.1 μm, He, 12.3 K/min; Tstart: 50. C; Tend: 350. C |
Capillary | Mega 5MS | 1427. | Verzera, la Rosa, et al., 2000 | 30. m/0.25 mm/0.25 μm, He, 40. C @ 2. min, 3. K/min; Tend: 240. C |
Capillary | Mega 5MS | 1427. | Verzera, Trozzi, et al., 2000 | 30. m/0.25 mm/0.25 μm, He, 40. C @ 2. min, 3. K/min; Tend: 240. C |
Capillary | BP-1 | 1432. | Lota, Serra, et al., 1999 | 50. m/0.22 mm/0.25 μm, He, 2. K/min, 230. C @ 35. min; Tstart: 60. C |
Capillary | BP-1 | 1432. | Mazzoni, Tomi, et al., 1999 | 50. m/0.22 mm/0.25 μm, He, 2. K/min, 220. C @ 20. min; Tstart: 60. C |
Capillary | DB-5 | 1432. | Sagrero-Nieves, Bartley, et al., 1997 | 30. m/0.26 mm/0.25 μm, He, 2. K/min, 225. C @ 20. min; Tstart: 50. C |

Van Den Dool and Kratz RI, non-polar column, custom temperature program

Column type | Active phase | I | Reference | Comment |
---|---|---|---|---|
Capillary | HP-5MS | 1440. | Andriamaharavo, 2014 | 30. m/0.25 mm/0.25 μm, He; Program: 60C (1 min) => 5 C/min => 210C => 10 C/min => 280C (15 min) |
Capillary | BPX-5 | 1442. | Cardeal, da Silva, et al., 2006 | 30. m/0.25 mm/0.25 μm; Program: 35C(5min) => 3C/min => 210C => 40C/min => 240C (4min) |
Capillary | SE-52 | 1454. | Guerrini, Sacchetti, et al., 2006 | 30. m/0.32 mm/0.15 μm, He; Program: 45C => 1C/min => 100C => 5C/min => 250C (10min) |
Capillary | SPB-1 | 1440. | Díaz-Maroto, Sánchez Palomo, et al., 2004 | 50. m/0.25 mm/0.25 μm; Program: 70C(3min) => 4C/min => 120C => 8C/min => 250C |
Capillary | SE-52 | 1436. | Lorenzo, Loayza, et al., 2003 | 25. m/0.25 mm/0.25 μm, He; Program: 60C(8min) => 3C/min => 180C => 20C/min => 230C |
Capillary | DB-5 | 1405. | Boulanger, Chassagne, et al., 1999 | 30. m/0.25 mm/0.25 μm, H2; Program: 40C(5min) => 2C/min => 220C => 5C/min => 250C(15min) |
Capillary | DB-5 | 1436. | Boulanger, Chassagne, et al., 1999 | 30. m/0.25 mm/0.25 μm, H2; Program: 40C(5min) => 2C/min => 220C => 5C/min => 250C(15min) |
Capillary | BPX-5 | 1460. | Elmore, Erbahadir, et al., 1997 | 50. m/0.32 mm/0.5 μm, He; Program: 0C (5min) => 40C/min => 40C (2min) => 10C/min => 280C |

Van Den Dool and Kratz RI, polar column, temperature ramp

Column type | Active phase | I | Reference | Comment |
---|---|---|---|---|
Capillary | BP-20 | 1582. | Boti, Koukoua, et al., 2007 | 50. m/0.22 mm/0.25 μm, He, 2. K/min, 220. C @ 20. min; Tstart: 60. C |
Capillary | RTX-Wax | 1580. | Paolini J., Costa J., et al., 2007 | 60. m/0.22 mm/0.25 μm, He, 2. K/min, 230. C @ 35. min; Tstart: 60. C |
Capillary | RTX-Wax | 1580. | Paolini, Muselli, et al., 2007 | 60. m/0.22 mm/0.25 μm, He, 2. K/min, 230. C @ 35. min; Tstart: 60. C |
Capillary | RTX-Wax | 1585. | Cavalli, Tomi, et al., 2006 | 60. m/0.22 mm/0.25 μm, He, 2. K/min, 230. C @ 45. min; Tstart: 60. C |
Capillary | RTX-Wax | 1560. | Paolini J., Desjobert J.M., et al., 2006 | 60. m/0.22 mm/0.25 μm, He, 2. K/min, 230. C @ 35. min; Tstart: 60. C |
Capillary | Supelcowax-10 | 1580. | Pinto, Pina-Vaz, et al., 2006 | 30. m/0.2 mm/0.2 μm, He, 3. K/min, 220. C @ 15. min; Tstart: 70. C |
Capillary | PEG-20M | 1581. | Rubiolo P., Matteodo M., et al., 2006 | 25. m/0.25 mm/0.3 μm, He, 50. C @ 1. min, 3. K/min, 220. C @ 5. min |
Capillary | BP-20 | 1587. | Boti J.B., Koukoua G., et al., 2005 | 50. m/0.22 mm/0.25 μm, He, 2. K/min, 220. C @ 20. min; Tstart: 60. C |
Capillary | RTX-Wax | 1575. | Cozzani, Muselli, et al., 2005 | 60. m/0.22 mm/0.25 μm, 2. K/min, 220. C @ 20. min; Tstart: 60. C |
Capillary | DB-Wax | 1573. | Fanciullino, Gancel, et al., 2005 | 30. m/0.25 mm/0.25 μm, He, 3. K/min, 250. C @ 20. min; Tstart: 40. C |
Capillary | DB-Wax | 1575. | Gancel, Ollitrault, et al., 2005 | 30. m/0.25 mm/0.25 μm, He, 3. K/min, 250. C @ 20. min; Tstart: 40. C |
Capillary | RTX-Wax | 1580. | Paolini, Costa, et al., 2005 | 60. m/0.22 mm/0.25 μm, He, 2. K/min, 230. C @ 35. min; Tstart: 60. C |
Capillary | Supelcowax-10 | 1560. | Smadja, Rondeau, et al., 2005 | 60. m/0.2 mm/0.2 μm, He, 2. K/min, 200. C @ 10. min; Tstart: 60. C |
Capillary | Megawax | 1560. | Verzera, Trozzi, et al., 2005 | 30. m/0.25 mm/0.25 μm, He, 40. C @ 6. min, 2. K/min, 220. C @ 10. min |
Capillary | RTX-Wax | 1568. | Dugo, Mondello, et al., 2004 | 30. m/0.25 mm/0.25 μm, He, 45. C @ 6. min, 3. K/min, 240. C @ 10. min |
Capillary | BP-20 | 1582. | Gonny, Bradesi, et al., 2004 | 50. m/0.22 mm/0.25 μm, 2. K/min, 220. C @ 20. min; Tstart: 60. C |
Capillary | HP-Innowax | 1590. | Grujic-Jovanovic, Skaltsa, et al., 2004 | 30. m/0.25 mm/0.5 μm, He, 3. K/min; Tstart: 60. C; Tend: 260. C |
Capillary | HP-Wax | 1589. | Bader, Caponi, et al., 2003 | 30. m/0.25 mm/0.25 μm, N2, 60. C @ 10. min, 5. K/min; Tend: 220. C |
Capillary | BP-20 | 1561. | Bianchini, Tomi, et al., 2003 | 50. m/0.22 mm/0.25 μm, He, 2. K/min, 230. C @ 35. min; Tstart: 60. C |
Capillary | RTX-Wax | 1576. | Cavalli, Tomi, et al., 2003 | 60. m/0.22 mm/0.25 μm, He, 2. K/min, 230. C @ 45. min; Tstart: 60. C |
Capillary | DB-Wax | 1575. | Gancel, Ollitrault, et al., 2003 | 60. m/0.32 mm/0.25 μm, H2, 1.5 K/min, 245. C @ 20. min; Tstart: 40. C |
Capillary | CP-Wax 52CB | 1565. | Kjeldsen, Christensen, et al., 2003 | 50. m/0.25 mm/0.2 μm, He, 32. C @ 1. min, 1. K/min; Tend: 220. C |
Capillary | Megawax | 1560. | Verzera, Trozzi, et al., 2003 | 30. m/0.25 mm/0.25 μm, He, 40. C @ 6. min, 2. K/min, 220. C @ 10. min |
Capillary | BP-20 | 1580. | Lota, de Rocca Serra, et al., 2002 | 50. m/0.22 mm/0.25 μm, He, 2. K/min, 220. C @ 20. min; Tstart: 60. C |
Capillary | RTX-Wax | 1570. | Mondello, Zappia, et al., 2002 | 30. m/0.25 mm/0.25 μm, He, 45. C @ 6. min, 3. K/min, 250. C @ 10. min |
Capillary | BP-20 | 1561. | Bianchini, Tomi, et al., 2001 | 50. m/0.22 mm/0.25 μm, He, 2. K/min, 230. C @ 35. min; Tstart: 60. C |
Capillary | BP-20 | 1580. | Lota, Serra, et al., 2001 | 50. m/0.22 mm/0.25 μm, He, 2. K/min; Tstart: 60. C; Tend: 220. C |
Capillary | BP-20 | 1580. | Lota, Serra, et al., 1999 | 50. m/0.22 mm/0.25 μm, He, 2. K/min, 230. C @ 35. min; Tstart: 60. C |
Capillary | BP-20 | 1579. | Mazzoni, Tomi, et al., 1999 | 50. m/0.22 mm/0.25 μm, He, 2. K/min, 220. C @ 20. min; Tstart: 60. C |
Capillary | DB-Wax | 1582. | Sagrero-Nieves, Bartley, et al., 1997 | 60. m/0.32 mm/0.5 μm, He, 2. K/min, 225. C @ 20. min; Tstart: 50. C |

Van Den Dool and Kratz RI, polar column, custom temperature program

Column type | Active phase | I | Reference | Comment |
---|---|---|---|---|
Capillary | RTX-Wax | 1559. | Dugo, Mondello, et al., 2004 | Program: not specified |
Capillary | Stabilwax | 1609. | Klesk, Qian, et al., 2004 | 30. m/0.32 mm/1. μm, He; Program: 40C (2min) => 5C/min => 100C => 4C/min => 230C (10min) |
Capillary | Carbowax 20M | 1585. | Bortolomeazzi, Berno, et al., 2001 | 30. m/0.25 mm/0.25 μm, He; Program: 60C(3min) => 4C/min => 160C => 10C/min => 280C |

Normal alkane RI, non-polar column, isothermal

Column type | Active phase | Temperature (C) | I | Reference | Comment |
---|---|---|---|---|---|
Packed | SE-30 | 175. | 1430. | Thompson, Baker, et al., 1971 | N2, Chromosorb P (60-80 mesh); Column length: 3.2 m |

Normal alkane RI, non-polar column, temperature ramp

Column type | Active phase | I | Reference | Comment |
---|---|---|---|---|
Capillary | DB-5 | 1437. | Rodriques, Amorim, et al., 2013 | 30. m/0.25 mm/0.25 μm, Helium, 3. K/min; Tstart: 60. C; Tend: 240. C |
Capillary | DB-5 | 1430. | Cao, Li, et al., 2011 | 30. m/0.25 mm/0.25 μm, Helium, 40. C @ 5. min, 3. K/min, 250. C @ 20. min |
Capillary | Elite-5 MS | 1434. | Baharum, Bunawan, et al., 2010 | 30. m/0.25 mm/0.25 μm, Helium, 4. K/min; Tstart: 40. C; Tend: 220. C |
Capillary | RTX-1 | 1432. | Dib, Djabou, et al., 2010 | 60. m/0.22 mm/0.25 μm, Helium, 2. K/min, 230. C @ 30. min; Tstart: 60. C |
Capillary | HP-5 MS | 1441. | Lazarevic, Radulovic, et al., 2010 | 30. m/0.25 mm/0.25 μm, Helium, 5. K/min; Tstart: 70. C; Tend: 290. C |
Capillary | HP-5 | 1441. | Radulovic, Dordevic, et al., 2010 | 30. m/0.25 mm/0.25 μm, Hydrogen, 5. K/min; Tstart: 70. C; Tend: 290. C |
Capillary | SPB-5 | 1443. | Gilani, Shah, et al., 2009 | 30. m/0.53 mm/0.50 μm, Nitrogen, 50. C @ 5. min, 3. K/min, 210. C @ 45. min |
Capillary | BP-1 | 1430. | Ottavioli, Bighelli, et al., 2009 | 50. m/0.22 mm/0.25 μm, Helium, 2. K/min, 220. C @ 20. min; Tstart: 60. C |
Capillary | DB-5 MS | 1445. | Patil, Jayaprakasha, et al., 2009 | 60. m/0.25 mm/0.25 μm, Helium, 40. C @ 12. min, 2. K/min, 330. C @ 30. min |
Capillary | DB-5 | 1446. | Porto, Decorti, et al., 2009 | 30. m/0.25 mm/0.25 μm, Helium, 45. C @ 3. min, 3. K/min, 250. C @ 5. min |
Capillary | HP-5 MS | 1440. | Bouwmeester, de Kraker, et al., 2008 | 30. m/0.25 mm/0.25 μm, Helium, 70. C @ 1. min, 5. K/min, 210. C @ 5. min |
Capillary | DB-5 | 1436. | Khokra, Prakash, et al., 2008 | 30. m/0.25 mm/0.25 μm, Helium, 100. C @ 2. min, 20. K/min, 300. C @ 10. min |
Capillary | SLB-5 MS | 1434. | Lo Presti, Sciarrone, et al., 2008 | 30. m/0.25 mm/0.25 μm, Helium, 50. C @ 2. min, 3. K/min, 250. C @ 10. min |
Capillary | HP-5 MS | 1439. | Sahraoui, Vian, et al., 2008 | 30. m/0.25 mm/0.25 μm, Helium, 60. C @ 8. min, 2. K/min, 250. C @ 15. min |
Capillary | DB-5 | 1431. | Bos, Woerdenbag, et al., 2007 | 30. m/0.26 mm/0.25 μm, He, 3. K/min; Tstart: 60. C; Tend: 240. C |
Capillary | DB-5 | 1431. | Elfami, Bos, et al., 2007 | 30. m/0.26 mm/0.25 μm, Helium, 3. K/min; Tstart: 60. C; Tend: 290. C |
Capillary | HP-5MS | 1437. | Ferhat, Meklati, et al., 2007 | 30. m/0.25 mm/0.25 μm, He, 60. C @ 8. min, 2. K/min, 250. C @ 15. min |
Capillary | HP-5MS | 1427. | Ferhat, Tigrine-Kordjani, et al., 2007 | 30. m/0.25 mm/0.25 μm, He, 60. C @ 8. min, 2. K/min, 250. C @ 15. min |
Capillary | Col-Elite 5MS | 1455. | Gudaityte and Venskutonis R.P., 2007 | 30. m/0.25 mm/0.25 μm, He, 3. K/min; Tstart: 30. C; Tend: 246. C |
Capillary | AT-5 | 1437. | Meccia, Rojas, et al., 2007 | 60. m/0.25 mm/0.25 μm, Helium, 4. K/min; Tstart: 60. C; Tend: 260. C |
Capillary | DB-5 | 1427. | Miyazawa and Tamura, 2007 | 30. m/0.25 mm/0.25 μm, He, 2. K/min; Tstart: 60. C; Tend: 240. C |
Capillary | DB-5 | 1437. | Morteza-Semnani, Saeedi, et al., 2007 | 30. m/0.25 mm/0.25 μm, Helium, 4. K/min; Tstart: 60. C; Tend: 220. C |
Capillary | HP-5 | 1437. | Oliveira, Leitão, et al., 2007 | 25. m/0.2 mm/0.33 μm, H2, 3. K/min; Tstart: 60. C; Tend: 240. C |
Capillary | Methyl Silicone | 1435. | Ozcan and Chalchat, 2007 | Helium, 3. K/min; Column length: 50. m; Column diameter: 0.25 mm; Tstart: 50. C; Tend: 240. C |
Capillary | DB-1 | 1432. | Pala-Paul, Brophy, et al., 2007 | 50. m/0.25 mm/0.25 μm, He, 4. K/min; Tstart: 95. C; Tend: 240. C |
Capillary | HP-5 | 1431. | Ristic, Krivokuca-Dokic, et al., 2007 | 30. m/0.25 mm/0.25 μm, Helium, 4. K/min; Tstart: 40. C; Tend: 260. C |
Capillary | DB-5 | 1433. | Askari and Sefidkon, 2006 | 30. m/0.25 mm/0.25 μm, He, 40. C @ 5. min, 4. K/min; Tend: 260. C |
Capillary | CP Sil 5 CB | 1438. | Ayoub, Al-Azizi, et al., 2006 | He, 10. K/min; Column length: 25. m; Tstart: 80. C; Tend: 270. C |
Capillary | DB-5 | 1433. | Bazargani, Almasirad, et al., 2006 | 30. m/0.25 mm/0.25 μm, He, 50. C @ 1. min, 2.5 K/min, 265. C @ 20. min |
Capillary | DB-5 | 1431. | Elfami, Komar, et al., 2006 | 30. m/0.26 mm/0.25 μm, Helium, 3. K/min; Tstart: 60. C; Tend: 290. C |
Capillary | HP-5 | 1432. | Figuérédo, Cabassu, et al., 2006 | 30. m/0.25 mm/0.25 μm, He, 50. C @ 5. min, 5. K/min, 300. C @ 5. min |
Capillary | DB-5 | 1436. | Garneau F.X., Collin G., et al., 2006 | 30. m/0.25 mm/0.25 μm, 40. C @ 2. min, 2. K/min, 210. C @ 33. min |
Capillary | RTX-1 | 1436. | Kula, Izydorczyk, et al., 2006 | 30. m/0.32 mm/0.25 μm, He, 4. K/min; Tstart: 60. C; Tend: 300. C |
Capillary | CP Sil 5 CB | 1446. | Kurowska and Galazka, 2006 | 30. m/0.25 mm/0.25 μm, N2, 60. C @ 4. min, 5. K/min; Tend: 300. C |
Capillary | DB-5 | 1442. | Navaei and Mirza, 2006 | 30. m/0.25 mm/0.25 μm, He, 50. C @ 5. min, 3. K/min; Tend: 250. C |
Capillary | DB-5 | 1442. | Ouamba, Ouabonzi, et al., 2006 | 25. m/0.25 mm/0.15 μm, N2, 50. C @ 3. min, 4. K/min; Tend: 200. C |
Capillary | DB-1 | 1438. | Pala-Paul J., Perez-Alonso M.J., et al., 2006 | 50. m/0.25 mm/0.25 μm, N2, 4. K/min; Tstart: 95. C; Tend: 240. C |
Capillary | HP-5 | 1439. | Potzernheim, Bizzo, et al., 2006 | 25. m/0.32 mm/0.25 μm, H2, 3. K/min; Tstart: 60. C; Tend: 240. C |
Capillary | DB-5 | 1435. | Rout, Naik, et al., 2006 | 30. m/0.25 mm/0.25 μm, He, 2. K/min, 200. C @ 60. min; Tstart: 60. C |
Capillary | HP-5MS | 1437. | Sajjadi, 2006 | 30. m/0.25 mm/0.25 μm, He, 4. K/min; Tstart: 60. C; Tend: 280. C |
Capillary | DB-5 | 1431. | Senatore, Landolfi, et al., 2006 | 30. m/0.25 mm/0.25 μm, He, 40. C @ 5. min, 2. K/min, 260. C @ 20. min |
Capillary | CP Sil 5 CB | 1436. | Tesso, König, et al., 2006 | H2, 3. K/min; Column length: 25. m; Column diameter: 0.25 mm; Tstart: 50. C; Tend: 230. C |
Capillary | DB-5MS | 1437. | Busman, Zoghbi, et al., 2005 | 30. m/0.25 mm/0.25 μm, He, 3. K/min; Tstart: 60. C; Tend: 240. C |
Capillary | DB-5 | 1432. | Chagonda and Chalchat, 2005 | 50. m/0.3 mm/0.25 μm, 2. K/min; Tstart: 60. C; Tend: 240. C |
Capillary | DB-5 | 1436. | Chaverri and Cicció, 2005 | 30. m/0.25 mm/0.25 μm, He, 3. K/min; Tstart: 60. C; Tend: 240. C |
Capillary | DB-5 | 1437. | Chaverri and Cicció, 2005 | 30. m/0.25 mm/0.25 μm, He, 3. K/min; Tstart: 60. C; Tend: 240. C |
Capillary | ZB-5 | 1452. | Dötterl, Wolfe, et al., 2005 | 60. m/0.25 mm/0.25 μm, He, 40. C @ 7. min, 6. K/min, 250. C @ 1. min |
Capillary | DB-1 | 1437. | Fakhari A.R., Sonboli A., et al., 2005 | 60. m/0.25 mm/0.25 μm, N2, 5. K/min, 250. C @ 10. min; Tstart: 60. C |
Capillary | DB-5 | 1433. | Ferraz, Limberger, et al., 2005 | 30. m/0.25 mm/0.25 μm, He, 60. C @ 3. min, 3. K/min; Tend: 300. C |
Capillary | HP-5 | 1432. | Figuérédo, Cabassu, et al., 2005 | 30. m/0.25 mm/0.25 μm, He, 50. C @ 5. min, 5. K/min, 300. C @ 5. min |
Capillary | HP-5MS | 1429. | Gauvin and Smadja, 2005 | 30. m/0.25 mm/0.25 μm, He, 60. C @ 30. min, 4. K/min; Tend: 200. C |
Capillary | DB-1 | 1419. | Khanavi, Ghasemian, et al., 2005 | 30. m/0.25 mm/0.25 μm, He, 50. C @ 1. min, 2.5 K/min, 265. C @ 20. min |
Capillary | DB-5 | 1439. | Kowalski and Wolski, 2005 | 30. m/0.25 mm/0.25 μm, 35. C @ 2. min, 4. K/min; Tend: 280. C |
Capillary | DB-5 | 1439. | Kowalski, 2005 | 30. m/0.25 mm/0.25 μm, Helium, 35. C @ 2. min, 4. K/min; Tend: 280. C |
Capillary | DB-5MS | 1409. | Marongiu, Piras, et al., 2005 | 30. m/0.25 mm/0.25 μm, He, 60. C @ 30. min, 3. K/min; Tend: 280. C |
Capillary | DB-5 | 1435. | Morteza-Semnani, Akbarzadeh, et al., 2005 | 30. m/0.25 mm/0.25 μm, He, 60. C @ 5. min, 4. K/min; Tend: 220. C |
Capillary | BP-1 | 1424. | Srivastava, Srivastava, et al., 2005 | 30. m/0.32 mm/0.25 μm, N2, 5. K/min, 220. C @ 15. min; Tstart: 60. C |
Capillary | RTX-5 | 1435. | Szafranek, Chrapkowska, et al., 2005 | 30. m/0.25 mm/0.25 μm, 3. K/min; Tstart: 60. C; Tend: 220. C |
Capillary | DB-5 | 1401. | Tzakou and Constantinidis, 2005 | 30. m/0.32 mm/0.25 μm, He, 3. K/min; Tstart: 60. C; Tend: 280. C |
Capillary | HP-5 | 1428. | Utsunomia, Kawata, et al., 2005 | 30. m/0.32 mm/0.25 μm, Helium, 4. K/min, 300. C @ 5. min; Tstart: 40. C |
Capillary | DB-1 | 1427. | Velasco-Negueruela, Pérez-Alonso, et al., 2005 | 50. m/0.25 mm/0.25 μm, N2, 4. K/min; Tstart: 90. C; Tend: 240. C |
Capillary | SPB-1 | 1432. | Wong, Lee, et al., 2005 | 50. m/0.2 mm/0.33 μm, He, 50. C @ 3. min, 4. K/min, 220. C @ 30. min |
Capillary | DB-5 | 1435. | Cicció, 2004 | 30. m/0.25 mm/0.25 μm, He, 2. K/min; Tstart: 60. C; Tend: 240. C |
Capillary | DB-1 | 1432. | Fekam Boyom, Fotio, et al., 2004 | 30. m/0.25 mm/0.25 μm, N2, 5. K/min; Tstart: 50. C; Tend: 200. C |
Capillary | SPB-5 | 1444. | Gauvin, Ravaomanarivo, et al., 2004 | 60. m/0.32 mm/1. μm, He, 4. K/min, 200. C @ 30. min; Tstart: 60. C |
Capillary | DB-5 | 1433. | JAvidnia, Mojab, et al., 2004 | 25. m/0.25 mm/0.25 μm, Nitrogen, 3. K/min; Tstart: 60. C; Tend: 240. C |
Capillary | ZB-5 | 1454. | Jürgens and Dötterl, 2004 | 60. m/0.25 mm/0.25 μm, He, 40. C @ 4.6 min, 6. K/min, 260. C @ 1. min |
Capillary | DB-5 | 1416. | Limberger, Sobral, et al., 2004 | 30. m/0.25 mm/0.25 μm, He, 3. K/min; Tstart: 60. C; Tend: 300. C |
Capillary | DB-1 | 1432. | Nik, Mirza, et al., 2004 | 60. m/0.25 mm/0.25 μm, He, 4. K/min; Tstart: 50. C; Tend: 270. C |
Capillary | DB-5 | 1435. | Tirillini, Pellegrino, et al., 2004 | 30. m/0.25 mm/0.25 μm, He, 3. K/min; Tstart: 60. C; Tend: 300. C |
Capillary | HP-1 | 1432. | Fekam Boyom, Amvam Zollo, et al., 2003 | 30. m/0.25 mm/0.25 μm, He, 10. K/min; Tstart: 70. C; Tend: 200. C |
Capillary | DB-1 | 1423. | Fekam Boyom, Ngouana, et al., 2003 | 30. m/0.25 mm/0.25 μm, N2, 5. K/min; Tstart: 50. C; Tend: 200. C |
Capillary | HP-1 | 1417. | Fernandez, Lizzani-Cuvelier, et al., 2003 | 50. m/0.2 mm/0.5 μm, He, 2. K/min, 220. C @ 45. min; Tstart: 60. C |
Capillary | HP-5 | 1439. | Ghannadi and Zolfaghari, 2003 | 30. m/0.25 mm/0.25 μm, He, 4. K/min; Tstart: 60. C; Tend: 275. C |
Capillary | CP Sil 5 CB | 1429. | Kanjilal, Kotoky, et al., 2003 | 25. m/0.25 mm/0.25 μm, He, 35. C @ 2.5 min, 5. K/min; Tend: 280. C |
Capillary | DB-5 | 1431. | Limberger, Simões-Pires, et al., 2003 | 30. m/0.25 mm/0.25 μm, He, 3. K/min; Tstart: 60. C; Tend: 250. C |
Capillary | DB-5MS | 1437. | Maia, Taveira, et al., 2003 | 30. m/0.25 mm/0.25 μm, He, 3. K/min; Tstart: 60. C; Tend: 240. C |
Capillary | DB-5 | 1427. | Marongiu, Porcedda, et al., 2003 | 30. m/0.25 mm/0.25 μm, He, 3. K/min, 280. C @ 30. min; Tstart: 60. C |
Capillary | HP-5 | 1415. | Pitarokili, Tzakou, et al., 2003 | 30. m/0.25 mm/0.25 μm, He, 3. K/min; Tstart: 60. C; Tend: 280. C |
Capillary | DB-5 | 1434. | Priestap, van Baren, et al., 2003 | 30. m/0.2 mm/0.25 μm, He, 75. C @ 4. min, 3. K/min; Tend: 220. C |
Capillary | Cross-Linked Methylsilicone | 1416. | Velasco-Negueruela, Pérez-Alonso, et al., 2003 | 25. m/0.2 mm/0.33 μm, He, 4. K/min; Tstart: 70. C; Tend: 250. C |
Capillary | HP-5 | 1440. | Yassa, Akhani, et al., 2003 | 30. m/0.25 mm/0.32 μm, He, 60. C @ 30. min, 5. K/min; Tend: 250. C |
Capillary | DB-5 | 1435. | Zoghbi, Andrade, et al., 2003 | 30. m/0.25 mm/0.25 μm, He, 3. K/min; Tstart: 60. C; Tend: 240. C |
Capillary | DB-5 | 1441. | Flamini, Ertugrul, et al., 2002 | 30. m/0.25 mm/0.25 μm, He, 3. K/min; Tstart: 60. C; Tend: 240. C |
Capillary | DB-1 | 1417. | Gancel, Ollé, et al., 2002 | 30. m/0.32 mm/0.25 μm, H2, 40. C @ 20. min, 3. K/min; Tend: 245. C |
Capillary | RSL-200 | 1431. | Jirovetz, Buchbauer, et al., 2002 | 30. m/0.32 mm/0.25 μm, H2, 40. C @ 5. min, 6. K/min, 280. C @ 5. min |
Capillary | DB-1 | 1430. | Khallouki, Younos, et al., 2002 | 25. m/0.23 mm/0.20 μm, He, 50. C @ 3. min, 3. K/min, 200. C @ 30. min |
Capillary | DB-5MS | 1435. | Maia, Zoghbi, et al., 2002 | 30. m/0.25 mm/0.25 μm, He, 3. K/min; Tstart: 60. C; Tend: 240. C |
Capillary | DB-1 | 1420. | Palá-Paúl, Pérez-Alonso, et al., 2002 | 50. m/0.25 mm/0.25 μm, N2, 4. K/min; Tstart: 80. C; Tend: 225. C |
Capillary | DB-1 | 1435. | Bailac, Dellacasa, et al., 2001 | 60. m/0.248 mm/0.25 μm, N2, 60. C @ 5. min, 3. K/min, 220. C @ 22. min |
Capillary | OV-1 | 1422. | Gallori, Bilia, et al., 2001 | 30. m/0.32 mm/0.3 μm, H2, 50. C @ 1. min, 3. K/min, 250. C @ 20. min |
Capillary | Optima-5 | 1435. | Jacquemond-Collet, Bessière, et al., 2001 | He, 50. C @ 3. min, 3. K/min; Column length: 30. m; Column diameter: 0.2 mm; Tend: 250. C |
Capillary | DB-5 | 1435. | Palmeira, Conserva, et al., 2001 | 30. m/0.25 mm/0.25 μm, He, 3. K/min; Tstart: 60. C; Tend: 270. C |
Capillary | DB-1 | 1434.0 | Santos, Moreira, et al., 2001 | He, 3. K/min; Column length: 30. m; Column diameter: 0.2 mm; Tstart: 60. C; Tend: 240. C |
Capillary | DB-5 | 1435. | Tellez M., Estell R., et al., 2001 | 30. m/0.25 mm/0.25 μm, He, 3. K/min; Tstart: 60. C; Tend: 240. C |
Capillary | HP-5 | 1435. | Bicalho, Pereira, et al., 2000 | 30. m/0.25 mm/0.25 μm, H2, 40. C @ 10. min, 3. K/min, 280. C @ 10. min |
Capillary | DB-1 | 1444. | Feger, Brandauer, et al., 2000 | 33. m/0.25 mm/0.50 μm, N2, 50. C @ 2. min, 20. K/min; Tend: 135. C |
Capillary | SPB-1 | 1437. | Fraternale, Giamperi, et al., 2000 | 30. m/0.2 mm/0.2 μm, He, 80. C @ 3. min, 5. K/min; Tend: 300. C |
Capillary | DB-5 | 1433. | Porta, Porcedda, et al., 1999 | 30. m/0.25 mm/0.25 μm, He, 40. C @ 5. min, 2. K/min, 250. C @ 60. min |
Capillary | DB-5 | 1436. | Zoghbi, Andrade, et al., 1999 | 30. m/0.25 mm/0.25 μm, He, 3. K/min; Tstart: 60. C; Tend: 240. C |
Capillary | DB-5MS | 1436. | Zoghbi, Andrade, et al., 1999, 2 | 30. m/0.25 mm/0.25 μm, He, 3. K/min; Tstart: 60. C; Tend: 240. C |
Capillary | DB-5 | 1435. | Tellez, Estell, et al., 1997 | 30. m/0.25 mm/0.25 μm, Helium, 3. K/min; Tstart: 60. C; Tend: 240. C |
Capillary | DB-5 | 1432.7 | Gawdzik, Mardarowicz, et al., 1996 | 30. m/0.25 mm/0.25 μm, 60. C @ 2. min, 4. K/min, 300. C @ 5. min |
Capillary | Methyl Silicone | 1436. | Gopalakrishnan, Menon, et al., 1993 | 50. m/0.25 mm/0.17 μm, N2, 2. K/min; Tstart: 80. C; Tend: 200. C |
Capillary | Methyl Silicone | 1431. | Gopalakrishnan, Menon, et al., 1993 | 50. m/0.25 mm/0.17 μm, N2, 3. K/min; Tstart: 80. C; Tend: 200. C |
Capillary | SE-54 | 1432. | Kollmannsberger, Nitz, et al., 1992 | 30. m/0.25 mm/0.25 μm, Hydrogen, 60. C @ 5. min, 2. K/min, 250. C @ 2. min |
Capillary | DB-1 | 1431. | Binder, Turner, et al., 1990 | 4. K/min, 230. C @ 10. min; Tstart: 50. C |
Capillary | DB-1 | 1431. | Binder, Turner, et al., 1990, 2 | 4. K/min, 230. C @ 10. min; Column length: 60. m; Column diameter: 0.32 mm; Tstart: 50. C |
Capillary | SE-30+Igepal | 1415. | Shibamoto and Jennings, 1977 | 1. K/min; Column length: 100. m; Column diameter: 0.25 mm; Tstart: 70. C; Tend: 170. C |
Capillary | SE-30+Igepal | 1419. | Shibamoto and Jennings, 1977 | 1. K/min; Column length: 100. m; Column diameter: 0.25 mm; Tstart: 70. C; Tend: 170. C |

Normal alkane RI, non-polar column, custom temperature program

Column type | Active phase | I | Reference | Comment |
---|---|---|---|---|
Capillary | DB-5 | 1432. | Rodriques, Amorim, et al., 2013 | 30. m/0.25 mm/0.25 μm, Helium; Program: not specified |
Capillary | DB-1 | 1434. | Albano, Lima, et al., 2012 | 30. m/0.25 mm/0.25 μm, Hydrogen; Program: 45 0C 3 0C/min -> 175 0C 15 0C/min -> 300 0C (10 min) |
Capillary | Polydimethyl siloxane with 5 % Ph groups | 1431. | da Silva, de Souza, et al., 2012 | 30. m/0.25 mm/0.25 μm, Helium; Program: 50 0C 4 0C/min -> 200 0C (5 min) 20 0C/min -> 280 0C |
Capillary | DB-5 | 1434. | Cao, Li, et al., 2011 | 30. m/0.25 mm/0.25 μm, Helium; Program: not specified |
Capillary | 5 % Phenyl polydimethyl siloxane | 1436. | Chaverri, Diaz, et al., 2011 | Program: not specified |
Capillary | RTX-1 | 1432. | Dib, Djabou, et al., 2010 | 60. m/0.22 mm/0.25 μm, Helium; Program: not specified |
Capillary | HP-5 | 1432. | Custer, 2009 | 25. m/0.32 mm/0.17 μm, Helium; Program: 60 0C (5 min) 4 0C/min -> 220 0C 11 0C/min -> 280 0C (15 min) |
Capillary | HP-5 | 1432. | Custer, 2009 | 25. m/0.32 mm/0.17 μm, Helium; Program: 60 0C (5 min) 4 0C/min -> 220 0C 11 0C/min -> 280 0C (15 min) |
Capillary | HP-5 | 1434. | Custer, 2009 | 25. m/0.32 mm/0.17 μm, Helium; Program: not specified |
Capillary | HP-5 | 1434. | Custer, 2009 | 25. m/0.32 mm/0.17 μm, Helium; Program: not specified |
Capillary | DB-1 | 1434. | Mendes, Trindade, et al., 2009 | 30. m/0.25 mm/0.25 μm, Hydrogen; Program: 45 0C 3 0C/min -> 175 0C 15 0C/min -> 300 0C (10 min) |
Capillary | DB-1 | 1434. | Mendes, Trindade, et al., 2009, 2 | 30. m/0.25 mm/0.25 μm, Hydrogen; Program: 45 0C 3 0C/min -> 175 0C 15 0C/min -> 300 0C (10 min) |
Capillary | DB-5 | 1431. | Porto, Decorti, et al., 2009 | 30. m/0.25 mm/0.25 μm, Helium; Program: not specified |
Capillary | DB-5 | 1440. | Porto, Decorti, et al., 2009 | 30. m/0.25 mm/0.25 μm, Helium; Program: not specified |
Capillary | CB-1 | 1443. | Kannaste, Vongvanich, et al., 2008 | 30. m/0.25 mm/0.25 μm, Helium; Program: 40 0C (2 min) 4 0C/min -> 180 0C 20 0C/min -> 220 0C (1 min) |
Capillary | CB-1 | 1434. | Kannaste, Vongvanich, et al., 2008 | 30. m/0.25 mm/0.25 μm, Helium; Program: not specified |
Capillary | SLB-5 MS | 1432. | Lo Presti, Sciarrone, et al., 2008 | 30. m/0.25 mm/0.25 μm, Helium; Program: not specified |
Capillary | CP-Sil 8CB-MS | 1435. | Profitt, Schatz, et al., 2008 | 30. m/0.25 mm/0.25 μm, Helium; Program: 50 0C(3 min) 3 0C/min -> 100 0C 2.7 0C/min -> 140 0C 2.4 0C/min -> 180 0C 6 0C/min -> 260 0C |
Capillary | DB-5 MS | 1431. | Silva, Doria, et al., 2008 | 30. m/0.25 mm/0.25 μm; Program: 80 0C (1.5 min) 4 pC/min -> 180 0C 10 0C/min -> 300 0C (10 min) |
Capillary | RTX-5 | 1440. | Zachariah, Leela, et al., 2008 | 30. m/0.25 mm/0.25 μm, Helium; Program: 60 0C (5 min) 5 0C/min -> 110 0C 3 0C/min -> 220 0C (5 min) |
Capillary | RTX-5 | 1435. | Zachariah, Leela, et al., 2008 | 30. m/0.25 mm/0.25 μm, Helium; Program: not specified |
Capillary | DB-1 | 1435. | Albuquerque, Vasconcelos Silva, et al., 2007 | 30. m/0.25 mm/0.1 μm, He; Program: 35C => 4C/min => 180C => 10C/min => 250C |
Capillary | HP-5 MS | 1436. | Eason and Setzer, 2007 | 30. m/0.25 mm/0.25 μm, Helium; Program: 40 0C (10 min) 3 0C/min -> 200 0C 2 0C/min -> 220 0C |
Capillary | DB-1 | 1434. | Ferreira, Meireles de Sousa, et al., 2007 | 30. m/0.25 mm/0.25 μm, He; Program: 45C => 3C/min => 175C => 15C/min => 300C (10min) |
Capillary | CP Sil 8 CB | 1433. | Meekijjaroenroj, Bessière, et al., 2007 | 30. m/0.25 mm/0.25 μm, He; Program: 50C(3min) => 3C/min => 100C => 2.7C/min => 140C => 2.4C/min => 180C => 6C/min => 250C |
Capillary | CP-Sil | 1417. | Proffit, 2007 | 30. m/0.25 mm/0.25 μm, Helium; Program: 50 0C (3 min) 3 0C/min -> 100 0C 2.7 0C/min -> 140 0C 2.4 0C/min -> 180 0C 6 0C/min -> 250 0C |
Capillary | CP-Sil | 1435. | Proffit, 2007 | 30. m/0.25 mm/0.25 μm, Helium; Program: 50 0C (3 min) 3 0C/min -> 100 0C 2.7 0C/min -> 140 0C 2.4 0C/min -> 180 0C 6 0C/min -> 250 0C |
Capillary | CP-Sil | 1435. | Proffit, 2007 | 30. m/0.25 mm/0.25 μm, Helium; Program: 50 0C (3 min) 3 0C/min -> 100 0C 2.7 0C/min -> 140 0C 2.4 0C/min -> 180 0C 6 0C/min -> 250 0C |
Capillary | CP Sil 8 CB | 1435. | Radusiene, Judzentiene, et al., 2007 | 50. m/0.32 mm/0.25 μm, Helium; Program: 60 0C (2 min) 5 0C/min -> 160 0C (1 min) 10 0C/min -> 280 0C (3 min) |
Capillary | HP-5 | 1432. | Ristic, Krivokuca-Dokic, et al., 2007 | 30. m/0.25 mm/0.25 μm, Helium; Program: not specified |
Capillary | DB-5 | 1435. | Santos, Santiago, et al., 2007 | 30. m/0.25 mm/0.25 μm, Hydrogen; Program: 35 0C 4 0C/min -> 180 0C 17 0C/min -> 280 0C (10 min) |
Capillary | HP-5 MS | 1436. | Setzer, Stokes, et al., 2007 | Helium; Column length: 30. m; Column diameter: 0.25 mm; Program: 40 0C (10 min) 3 oC/min -> 200 0C 2 0C/min -> 220 0C |
Capillary | HP-5MS | 1439. | Takaku, Haber, et al., 2007 | He; Column length: 30. m; Column diameter: 0.25 mm; Program: 40C(10min) => 3C/min => 200C => 2C/min => 220C |
Capillary | SE-52 | 1433. | Lorenzo, Loayza, et al., 2006 | 25. m/0.32 mm/0.42 μm, H2; Program: 60C(8min) => 3C/min => 180C => 20C/min => 250C (10min) |
Capillary | SE-54 | 1415. | Souza, Souza, et al., 2006 | 25. m/0.25 mm/0.25 μm, Helium; Program: 110 0C 2 0C/min -> 160 0C 5 0C/min -> 290 0C (5 min) |
Capillary | SE-52 | 1435. | Tognolini, Barocelli, et al., 2006 | 30. m/0.32 mm/0.15 μm, He; Program: 45C => 1C/min => 100C => 5C/min => 250C (10min) |
Capillary | VF-5MS | 1436. | Xie, Sun, et al., 2006 | 30. m/0.25 mm/0.25 μm, He; Program: 40C(1min) => 15C/min => 100C => 4C/min => 250C (1min) |
Capillary | DB-1 | 1434. | Belhattab, Larous, et al., 2005 | 30. m/0.25 mm/0.25 μm, He; Program: 45C => 3C/min => 175C => 15C/min => 300C(10min) |
Capillary | DB-1 | 1434. | Figueiredo, Sim-Sim, et al., 2005 | 30. m/0.25 mm/0.25 μm, He; Program: 45C => 3C/min => 175C => 15C/min => 300C (10min) |
Capillary | HP-5MS | 1440. | Novak, Draxler, et al., 2005 | 30. m/0.25 mm/0.25 μm; Program: 40C(5min) => 3C/min => 90C => 10C/min => 280C |
Capillary | HP-5 | 1437. | Singh, Maurya, et al., 2005 | Column length: 30. m; Column diameter: 0.32 mm; Program: 65C(1min) => 1C/min => 75C (2min) => 0.5C/min => 81C(2min) => 3C/min => 180C(7min) |
Capillary | DB-1 | 1435. | Cavalcanti, de Morais, et al., 2004 | He; Column length: 30. m; Column diameter: 0.25 mm; Program: 35C => 4C/min => 180C => 10C/min => 250C |
Capillary | HP-5MS | 1435. | Sahin, Gulluce, et al., 2004 | 30. m/0.25 mm/0.25 μm, He; Program: 50C(3min) => 3C/min => 150C(10min) => 10C/min => 250C |
Capillary | DB-1 | 1435. | Silva, Matos, et al., 2004 | 30. m/0.25 mm/0.25 μm, Helium; Program: 35 0C 4 0C/min -> 180 0C 10 0C/min -> 250 0C |
Capillary | DB-1 | 1442. | Silva, Matos, et al., 2003 | 30. m/0.25 mm/0.1 μm, He; Program: 35C => 4C/min => 180C => 10C/min => 250C |
Capillary | DB-5 | 1436. | Viana, Andrade-Neto, et al., 2002 | 30. m/0.25 mm/0.1 μm, He; Program: 35C => 4C/min => 180C => 20C/min => 280C |
Capillary | DB-1 | 1420. | Kéita, Vincent, et al., 2000 | 30. m/0.25 mm/0.25 μm, He; Program: not specified |
Capillary | DB-1 | 1434. | Pedro, da Silva, et al., 1999 | 30. m/0.25 mm/0.25 μm, He; Program: 45C => 3C/min => 170C => 15C/min => 300C(10min) |
Capillary | CP Sil 5 CB | 1433. | Weyerstahl, Marschall, et al., 1999 | 25. m/0.25 mm/0.39 μm, N2; Program: not specified |
Capillary | CP Sil 5 CB | 1433. | Weyerstahl, Marschall, et al., 1999, 2 | He; Column length: 25. m; Column diameter: 0.39 mm; Program: not specified |
Capillary | DB-1 | 1434. | Baratta, Dorman, et al., 1998 | 30. m/0.25 mm/0.25 μm, He; Program: 45C => 3C/min => 175C => 15C/min => 240C (10min) |
Capillary | DB-5 | 1440. | Sanda, Koba, et al., 1998 | 30. m/0.25 mm/0.25 μm, N2; Program: 45C(5min) => 2C/min => 200C => 5C/min => 250C |
Capillary | CP Sil 5 CB | 1434. | Weyerstahl, Marschall, et al., 1998 | N2; Column length: 25. m; Program: not specified |
Capillary | DB-5 | 1430. | Yusuf, Begum, et al., 1998 | 30. m/0.25 mm/0.25 μm, He; Program: 60C => 3C/min => 240C => 30C/min => 300C |
Capillary | DB-1 | 1434. | Figueiredo, Barroso, et al., 1997 | 30. m/0.25 mm/0.25 μm, H2; Program: 45C => 3C/min => 175C => 15C/min => 240C(10min) |
Capillary | DB-1 | 1434. | Barroso, Figueiredo, et al., 1996 | 30. m/0.25 mm/0.25 μm, H2; Program: 45 0C 3 0C/min -> 175 0C 15 0C/min -> 240 0C (10 min) |

Normal alkane RI, polar column, temperature ramp

Column type | Active phase | I | Reference | Comment |
---|---|---|---|---|
Capillary | RTX-Wax | 1575. | Dib, Djabou, et al., 2010 | 60. m/0.22 mm/0.25 μm, Helium, 2. K/min, 230. C @ 30. min; Tstart: 60. C |
Capillary | BP-20 | 1587. | Ottavioli, Bighelli, et al., 2009 | 50. m/0.22 mm/0.25 μm, Helium, 2. K/min, 220. C @ 20. min; Tstart: 60. C |
Capillary | DB-Wax | 1577. | Beck, Higbee, et al., 2008 | 60. m/0.32 mm/0.25 μm, Helium, 30. C @ 4. min, 2. K/min, 200. C @ 30. min |
Capillary | DB-Wax | 1582. | Beck, Higbee, et al., 2008 | 60. m/0.32 mm/0.25 μm, Helium, 30. C @ 4. min, 2. K/min, 200. C @ 30. min |
Capillary | Carbowax | 1577. | Ferhat, Meklati, et al., 2007 | 60. m/0.2 mm/0.25 μm, He, 60. C @ 8. min, 2. K/min, 250. C @ 15. min |
Capillary | Carbowax | 1562. | Ferhat, Tigrine-Kordjani, et al., 2007 | 60. m/0.2 mm/0.25 μm, He, 60. C @ 8. min, 2. K/min, 250. C @ 15. min |
Capillary | TC-Wax | 1584. | Miyazawa and Tamura, 2007 | 60. m/0.25 mm/0.25 μm, He, 2. K/min; Tstart: 60. C; Tend: 240. C |
Capillary | DB-Wax | 1583. | Pala-Paul, Brophy, et al., 2007 | 60. m/0.32 mm/0.25 μm, He, 4. K/min; Tstart: 70. C; Tend: 220. C |
Capillary | Supelcowax-10 | 1585. | Garneau F.X., Collin G., et al., 2006 | 30. m/0.25 mm/0.25 μm, 40. C @ 2. min, 2. K/min, 210. C @ 33. min |
Capillary | BP-20 | 1580. | Lesueur, Ban, et al., 2006 | 50. m/0.22 mm/0.25 μm, He, 2. K/min, 220. C @ 20. min; Tstart: 60. C |
Capillary | Supelcowax | 1564. | Gauvin and Smadja, 2005 | 60. m/0.2 mm/0.2 μm, He, 60. C @ 30. min, 4. K/min; Tend: 230. C |
Capillary | Supelcowax-10 | 1574. | Wong, Lee, et al., 2005 | 30. m/0.25 mm/0.25 μm, He, 50. C @ 3. min, 4. K/min, 220. C @ 30. min |
Capillary | HP-Innowax | 1595. | Velasco-Negueruela, Pérez-Alonso, et al., 2003, 2 | 50. m/0.2 mm/0.2 μm, He, 5. K/min; Tstart: 70. C; Tend: 190. C |
Capillary | DB-Wax | 1573. | Gancel, Ollé, et al., 2002 | 60. m/0.32 mm/0.25 μm, H2, 1.5 K/min, 245. C @ 20. min; Tstart: 40. C |
Capillary | DB-Wax | 1583. | Umano, Hagi, et al., 2000 | 60. m/0.25 mm/0.25 μm, He, 40. C @ 2. min, 2. K/min; Tend: 200. C |
Capillary | NB-351 | 1614. | Onocha, Ekundayo, et al., 1999 | 25. m/0.3 mm/0.5 μm, H2, 70. C @ 2. min, 5. K/min; Tend: 250. C |
Capillary | DB-Wax | 1577. | Werkhoff, Güntert, et al., 1998 | 60. m/0.32 mm/0.25 μm, H2, 3. K/min; Tstart: 60. C; Tend: 220. C |
Capillary | Carbowax 20M | 1579. | Kollmannsberger, Nitz, et al., 1992 | 45. m/0.32 mm/1.0 μm, Hydrogen, 60. C @ 5. min, 2. K/min; Tend: 200. C |
Capillary | DB-Wax | 1580. | Binder, Turner, et al., 1990 | 4. K/min, 230. C @ 10. min; Column length: 60. m; Column diameter: 0.32 mm; Tstart: 50. C |
Capillary | DB-Wax | 1580. | Binder, Turner, et al., 1990, 2 | 4. K/min, 230. C @ 10. min; Column length: 60. m; Column diameter: 0.32 mm; Tstart: 50. C |
Capillary | Carbowax 20M | 1560. | Gaydou, Faure, et al., 1989 | 50. m/0.32 mm/0.15 μm, H2, 2. K/min; Tstart: 70. C; Tend: 210. C |
Capillary | Carbowax 20M | 1610. | Shibamoto and Jennings, 1977 | 1. K/min; Column length: 100. m; Column diameter: 0.25 mm; Tstart: 70. C; Tend: 170. C |
Capillary | Carbowax 20M | 1611. | Shibamoto and Jennings, 1977 | 1. K/min; Column length: 100. m; Column diameter: 0.25 mm; Tstart: 70. C; Tend: 170. C |

Normal alkane RI, polar column, custom temperature program

Column type | Active phase | I | Reference | Comment |
---|---|---|---|---|
Capillary | Carbowax 20M | 1536. | Lorenzo, Loayza, et al., 2006 | 25. m/0.32 mm/0.25 μm, H2; Program: 40C(8min) => 3C/min => 180C => 20C/min => 230C (10min) |
Capillary | Supelcowax-10 | 1592. | Vichi, Guadayol, et al., 2006 | 30. m/0.25 mm/0.25 μm, He; Program: 40C(3min) => 4C/min => 75C => 8C/min => 260C(5min) |
Capillary | HP-Innowax FSC | 1568. | Sezik E., Kocakulak E., et al., 2005 | 60. m/0.25 mm/0.25 μm, He; Program: 60C(10min) => 4C/min => 220C(10min) => 1C/min => 240C |
Capillary | HP-Innowax FSC | 1568. | Viljoen, Subramoney, et al., 2005 | 60. m/0.25 mm/0.25 μm, He; Program: 60C(10min) => 4C/min => 220C(10min) => 1C/min => 240C |
Capillary | Carbowax 20M | 1585. | Gallori, Bilia, et al., 2001 | H2; Program: not specified |
Capillary | FFAP | 1568. | Tucker, Maciarello, et al., 2001 | 50. m/0.2 mm/0.33 μm; Program: 60C(1min) => 2.5C/min => 115C => 1C/min => 210C(30min) |
Capillary | RTX-Wax | 1551. | Kéita, Vincent, et al., 2000 | 30. m/0.25 mm/0.25 μm, He; Program: not specified |

References

Szafranek, Chrapkowska, et al., 2005
Szafranek, B.; Chrapkowska, K.; Pawinska, M.; Szafranek, J.,
Analysis of leaf surface sesquiterpenes in potato varieties,
J. Agric. Food Chem., 2005, 53, 8, 2817-2822, https://doi.org/10.1021/jf040437g
. [all data]
Hazzit, Baaliouamer, et al., 2006
Hazzit, M.; Baaliouamer, A.; Faleiro, M.L.; Miguel, M.G.,
Composition of the Essential Oils of Thymus and Origanum Species from Algeria and Their Antioxidant and Antimicrobial Activities,
J. Agric. Food Chem., 2006, 54, 17, 6314-6321, https://doi.org/10.1021/jf0606104
. [all data]
Lucero, Fredrickson, et al., 2006
Lucero, M.E.; Fredrickson, E.L.; Estell, R.E.; Morrison, A.A.; Richman, D.B.,
Volatile Composition of Gutierrezia sarothrae (Broom Snakeweed) as Determined by Steam Distillation and Solid Phase Microextraction,
J. Essent. Oil Res., 2006, 18, 2, 121-125, https://doi.org/10.1080/10412905.2006.9699039
. [all data]
Raina, Verma, et al., 2006
Raina, V.K.; Verma, S.C.; Dhawan, S.; Khan, M.; Ramesh, S.; Singh, S.C.; Yadav, A.; Srivastava, S.K.,
Essential oil composition of Murraya exotica from the plains of northern India,
Flavour Fragr. J., 2006, 21, 1, 140-142, https://doi.org/10.1002/ffj.1547
. [all data]
Asuming, Beauchamp, et al., 2005
Asuming, W.A.; Beauchamp, P.S.; Descalzo, J.T.; Dev, B.C.; Dev, V.; Frost, S.; Ma, C.W.,
Essential oil composition of four Lomatium Raf. species and their chemotaxonomy,
Biochem. Syst. Ecol., 2005, 33, 1, 17-26, https://doi.org/10.1016/j.bse.2004.06.005
. [all data]
Barbosa, Paula, et al., 2005
Barbosa, L.C.A.; Paula, V.F.; Azevedo, A.S.; Silva, E.A.M.; Nascimento, E.A.,
Essential oil composition from some plant parts of Conyza bonariensis (L.) Cronquist,
Flavour Fragr. J., 2005, 20, 1, 39-41, https://doi.org/10.1002/ffj.1392
. [all data]
Medina, Lucero, et al., 2005
Medina, A.L.; Lucero, M.E.; Holguin, F.O.; Estell, R.E.; Posakony, J.J.; Simon, J.; O'Connell, M.A.,
Composition and antimicrobial activity of Anemopsis californica leaf oil,
J. Agric. Food Chem., 2005, 53, 22, 8694-8698, https://doi.org/10.1021/jf0511244
. [all data]
Bouzouita, Kachouri, et al., 2003
Bouzouita, N.; Kachouri, F.; Hamdi, M.; Chaabouni, M.M.,
Antimicrobial activity of essential oils from Tunisian aromatic plants,
Flavour Fragr. J., 2003, 18, 5, 380-383, https://doi.org/10.1002/ffj.1200
. [all data]
Lucero, Estell, et al., 2003
Lucero, M.E.; Estell, R.E.; Frederickson, E.L.,
The essential oil composition of Psorothamnus scoparius (A. Gray) Rydb.,
J. Essent. Oil Res., 2003, 15, 2, 108-111, https://doi.org/10.1080/10412905.2003.9712083
. [all data]
Viña and Murillo, 2003
Viña, A.; Murillo, E.,
Essential oil composition from twelve varieties of basil (Ocimum spp) grown in Columbia,
J. Braz. Chem. Soc., 2003, 14, 5, 744-749, https://doi.org/10.1590/S0103-50532003000500008
. [all data]
Buchin, Salmon, et al., 2002
Buchin, S.; Salmon, J.-C.; Carnat, A.-P.; Berger, T.; Bugaud, C.; Bosset, J.O.,
Identification de composés monoterpéniques, sesquiterpéniques et benzéniques dans un lait d'alpage très riche en ces substances,
Mitt. Lebensmittelunters. Hyg., 2002, 93, 199-216. [all data]
Salido, Altarejos, et al., 2002
Salido, S.; Altarejos, J.; Nogueras, M.; Sánchez, A.; Pannecouque, C.; Witvrouw, M.; De Clercq, E.,
Chemical studies of essential oils of Juniperus oxycedrus ssp. badia,
J. Ethnopharmacol., 2002, 81, 1, 129-134, https://doi.org/10.1016/S0378-8741(02)00045-4
. [all data]
Thangadurai, Anitha, et al., 2002
Thangadurai, D.; Anitha, S.; Pullaiah, T.; Reddy, P.N.; Ramachandraiah, O.S.,
Essential oil constituents and in vitro antimicrobial activity of Decalepis hamiltonii roots against foodborne pathogens,
J. Agric. Food Chem., 2002, 50, 11, 3147-3149, https://doi.org/10.1021/jf011541q
. [all data]
Senatore and Rigano, 2001
Senatore, F.; Rigano, D.,
Essential oil of two Lippia spp. (Verbenaceae) growing wild in Guatemala,
Flavour Fragr. J., 2001, 16, 3, 169-171, https://doi.org/10.1002/ffj.972
. [all data]
Jayaprakasha, Rao, et al., 2000
Jayaprakasha, G.K.; Rao, L.J.M.; Sakariah, K.K.,
Chemical composition of the flower oil of Cinnamomum zeylanicum blume,
J. Agric. Food Chem., 2000, 48, 9, 4294-4295, https://doi.org/10.1021/jf991395c
. [all data]
Roussis, Tsoukatou, et al., 2000
Roussis, V.; Tsoukatou, M.; Petrakis, P.V.; Chinou, I.; Skoula, M.; Harborne, J.B.,
Volatile constituents of four Helichrysum species growing in Greece,
Biochem. Syst. Ecol., 2000, 28, 2, 163-175, https://doi.org/10.1016/S0305-1978(99)00046-0
. [all data]
Weissbecker B., Van Loon J.J.A., et al., 2000
Weissbecker B.; Van Loon J.J.A.; Posthumus M.A.; Bouwmeester H.J.; Dicke M.,
Identification of volatile potato sesquiterpenoids and their olfactory detection by the two-spotted stinkbug Perillus bioculatus,
J. Chem. Ecol., 2000, 26, 6, 1433-1445, https://doi.org/10.1023/A:1005535708866
. [all data]
Kaul, Gujral, et al., 1999
Kaul, V.K.; Gujral, R.K.; Singh, B.,
Volatile constituents of the essential oil of flowers of Rosa brunonii Lindl,
Flavour Fragr. J., 1999, 14, 1, 9-11, https://doi.org/10.1002/(SICI)1099-1026(199901/02)14:1<9::AID-FFJ761>3.0.CO;2-C
. [all data]
Sajjadi and Ghassemi, 1999
Sajjadi, S.E.; Ghassemi, N.,
Volatile constituents of Nepeta glomerulosa Boiss. subsp. carmanica,
Flavour Fragr. J., 1999, 14, 5, 265-267, https://doi.org/10.1002/(SICI)1099-1026(199909/10)14:5<265::AID-FFJ822>3.0.CO;2-A
. [all data]
da Silva, Zoghbi, et al., 1999
da Silva, M.H.L.; Zoghbi, M.G.B.; Andrade, E.H.A.; Maia, J.G.S.,
The essential oils of Peperomia pellucida Kunth and P. circinnata link var. circinnata,
Flavour Fragr. J., 1999, 14, 5, 312-314, https://doi.org/10.1002/(SICI)1099-1026(199909/10)14:5<312::AID-FFJ835>3.0.CO;2-B
. [all data]
Mallavarapu, Rao, et al., 1998
Mallavarapu, G.R.; Rao, B.R.R.; Kaul, P.N.; Ramesh, S.; Bhattacharya, A.K.,
Volatile constituents of the essential oils of the seeds and the herb of palmarosa (Cymbopogon martinii (Roxb.) Wats. var. motia Burk.),
Flavour Fragr. J., 1998, 13, 3, 167-169, https://doi.org/10.1002/(SICI)1099-1026(199805/06)13:3<167::AID-FFJ719>3.0.CO;2-B
. [all data]
Ekundayo, Laakso, et al., 1988
Ekundayo, O.; Laakso, I.; Adegbola, R.-M.; Oguntimein, B.; Sofowora, A.; Hiltunen, R.,
Essential oil constituents of Ashanti pepper (Piper guineense) fruits (berries),
J. Agric. Food Chem., 1988, 36, 5, 880-882, https://doi.org/10.1021/jf00083a001
. [all data]
Khan, Verma, et al., 2006
Khan, M.; Verma, S.C.; Srivastava, S.K.; Shawl, A.S.; Syamsundar, K.V.; Khanuja, S.P.S.; Kumar, T.,
Essential oil composition of Taxus wallichiana Zucc. from the Northern Himalayan region of India,
Flavour Fragr. J., 2006, 21, 5, 772-775, https://doi.org/10.1002/ffj.1682
. [all data]
Shellie and Marriott, 2003
Shellie, R.A.; Marriott, P.J.,
Comprehensive two-dimensional gas chromatography-mass spectrometry analysis of Pelargonium graveolens essential oil using rapid scanning quadrupole mass spectrometry,
Analyst, 2003, 128, 7, 879-883, https://doi.org/10.1039/b304371a
. [all data]
Novak, Zitterl-Eglseer, et al., 2001
Novak, J.; Zitterl-Eglseer, K.; Deans, S.G.; Franz, C.M.,
Essential oils of different cultivars of Cannabis sativa L. and their antimicrobial activity,
Flavour Fragr. J., 2001, 16, 4, 259-262, https://doi.org/10.1002/ffj.993
. [all data]
Maia, Andrade, et al., 2000
Maia, J.G.S.; Andrade, E.H.A.; Zoghbi, M.G.B.,
Volatile constituents of the leaves, fruits and flowers of cashew ( Anacardium occidentaleL.),
J. Food Comp. Anal., 2000, 13, 3, 227-232, https://doi.org/10.1006/jfca.2000.0894
. [all data]
Santos, Andrade, et al., 1998
Santos, A.S.; Andrade, E.H.A.; Zoghbi, M.G.B.; Maia, J.G.S.,
Volatile constituents of fruits of Annona glabra L. from Brazil,
Flavour Fragr. J., 1998, 13, 3, 148-150, https://doi.org/10.1002/(SICI)1099-1026(199805/06)13:3<148::AID-FFJ711>3.0.CO;2-Y
. [all data]
Tressl, Friese, et al., 1978
Tressl, R.; Friese, L.; Fendesack, F.; Köppler, H.,
Studies of the volatile composition of hops during storage,
J. Agric. Food Chem., 1978, 26, 6, 1426-1430, https://doi.org/10.1021/jf60220a036
. [all data]
Benkaci-Ali, Baaliouamer, et al., 2007
Benkaci-Ali, F.; Baaliouamer, A.; Meklati, B.Y.; Chemat, F.,
Chemical composition of seed essential oils from Algerian Nigella sativa extracted by microwave and hydrodistillation,
Flavour Fragr. J., 2007, 22, 2, 148-153, https://doi.org/10.1002/ffj.1773
. [all data]
Boti, Koukoua, et al., 2007
Boti, J.B.; Koukoua, G.; N'Guessan, T.Y.; Casanova, J.,
Chemical variability of Conyza sumatrensis and Microglossa pyrifolia from Côte d'Ivoire,
Flavour Fragr. J., 2007, 22, 1, 27-31, https://doi.org/10.1002/ffj.1743
. [all data]
Flamini, Tebano, et al., 2007
Flamini, G.; Tebano, M.; Cioni, P.L.,
Volatiles emission patterns of different plant organs and pollen of Citrus limon,
Anal. Chim. Acta., 2007, 589, 1, 120-124, https://doi.org/10.1016/j.aca.2007.02.053
. [all data]
Martins, Santos, et al., 2007
Martins, F.T.; Santos, M.H.; Polo, M.; Barbosa, L.C.A.,
Effects of the interactions among macronutrients, plant age and photoperiod in the composition of Hyptis suaveolens (L.) Poit essential oil from Alfenas (MG), Brazil,
Flavour Fragr. J., 2007, 22, 2, 123-129, https://doi.org/10.1002/ffj.1769
. [all data]
Paolini J., Costa J., et al., 2007
Paolini J.; Costa J.; Bernardini A.F.,
Analysis of the essential oil from the roots of Eupatorium cannabinum subsp corsicum (L.) by GC, GC-MS and C-13-NMR,
Phytochem. Anal., 2007, 18, 3, 235-244, https://doi.org/10.1002/pca.977
. [all data]
Paolini, Muselli, et al., 2007
Paolini, J.; Muselli, A.; Bernardini, A.-F.; Bighelli, A.; Casanova, J.; Costa, J.,
Thymol derivatives from essential oil of Doronicum corsicum L.,
Flavour Fragr. J., 2007, 22, 6, 479-487, https://doi.org/10.1002/ffj.1824
. [all data]
Quijano, Salamanca, et al., 2007
Quijano, C.E.; Salamanca, G.; Pino, J.A.,
Aroma volatile constituents of Colombian varieties of mango (Mangifera indica L.),
Flavour Fragr. J., 2007, 22, 5, 401-406, https://doi.org/10.1002/ffj.1812
. [all data]
Sabulal, Dan, et al., 2007
Sabulal, B.; Dan, M.; John, A.; Kurup, R.; Chandrika, S.P.; George, V.,
Phenylbutanoid-rich rhizome oil of Zingiber neesanum from Western Ghats, southern India,
Flavour Fragr. J., 2007, 22, 6, 521-524, https://doi.org/10.1002/ffj.1834
. [all data]
Sonboli, Azizian, et al., 2007
Sonboli, A.; Azizian, D.; Yousefzadi, M.; Kanani, M.R.; Mehrabian, A.R.,
Volatile constituents and antimicrobial activity of the essential oil of Tetrataenium lasiopetalum (Apiaceae) from Iran,
Flavour Fragr. J., 2007, 22, 2, 119-122, https://doi.org/10.1002/ffj.1767
. [all data]
Blagojevic, Radulovic, et al., 2006
Blagojevic, P.; Radulovic, N.; Palic, R.; Stojanovic, G.,
Chemical composition of the essential oils of Serbian wild-growing Srtemisia absinthium and Artemisia vulgaris,
J. Agric. Food Chem., 2006, 54, 13, 4780-4789, https://doi.org/10.1021/jf060123o
. [all data]
Cavalli, Tomi, et al., 2006
Cavalli, J.-F.; Tomi, F.; Bernardini, A.-F.; Casanova, J.,
Chemical variability of the essential oil of Helichrysum faradifani Sc. Ell. from Madagascar,
Flavour Fragr. J., 2006, 21, 1, 111-114, https://doi.org/10.1002/ffj.1531
. [all data]
Dob, Dahmane, et al., 2006
Dob, T.; Dahmane, D.; Agli, M.; Chelghoum, C.,
Essential oil composition of Lavandula stoechas from Algeria,
Pharm. Biol., 2006, 44, 1, 60-64, https://doi.org/10.1080/13880200500496421
. [all data]
Flamini, Tebano, et al., 2006
Flamini, G.; Tebano, M.; Cioni, P.L.; Bagci, Y.; Dural, H.; Ertugrul, K.; Uysal, T.; Savran, A.,
A multivariate statistical approach to Centaurea classification using essential oil composition data of some species from Turkey,
Pl. Syst. Evol., 2006, 261, 1-4, 217-228, https://doi.org/10.1007/s00606-006-0448-3
. [all data]
Paolini J., Desjobert J.M., et al., 2006
Paolini J.; Desjobert J.M.; Costa J.; Bernardini A.F.; Castellini C.B.; Cioni P.L.; Flamini G.; Morelli I.,
Composition of essential oils of Helichrysum italicum (Roth) G. Don fil subsp. italicum from Tuscan archipelago islands,
Flavour Fragr. J., 2006, 21, 5, 805-808, https://doi.org/10.1002/ffj.1726
. [all data]
Pinto, Pina-Vaz, et al., 2006
Pinto, E.; Pina-Vaz, C.; Salgueiro, L.; Goncalves, M.J.; Costa-de-Oliveira, S.; Cavaleiro, C.; Palmeira, A.; Rodrigues, A.; Martinez-de-Oliveira, J.,
Antifuncal activity of the essential oil Thymus pulegioides on Candida, Aspergillus and dermatophyte species,
Journal of Medical Microbiology, 2006, 55, 10, 1367-1373, https://doi.org/10.1099/jmm.0.46443-0
. [all data]
Radulovic, Mananjarasoa, et al., 2006
Radulovic, N.; Mananjarasoa, E.; Harinantenaina, L.; Yoshinori, A.,
Essential oil composition of four Croton species from Madagascar and their chemotaxonomy,
Biochem. Syst. Ecol., 2006, 34, 8, 648-653, https://doi.org/10.1016/j.bse.2006.02.005
. [all data]
Rubiolo P., Matteodo M., et al., 2006
Rubiolo P.; Matteodo M.; Riccio G.; Ballero M.; Christen P.; Fleury-Souverain S.; Veuthey J.L.; Bicchi C.,
Analytical discrimination of poisonous and nonpoisonous chemotypes of giant fennel (Ferula communis L.) through their biologically active and volatile fractions,
J. Agric. Food Chem., 2006, 54, 20, 7556-7563, https://doi.org/10.1021/jf061592t
. [all data]
Saroglou, Dorizas, et al., 2006
Saroglou, V.; Dorizas, N.; Kypriotakis, Z.; Skaltsa, H.D.,
Analysis of the essential oil composition of eight Anthemis species from Greece,
J. Chromatogr. A, 2006, 1104, 1-2, 313-322, https://doi.org/10.1016/j.chroma.2005.11.087
. [all data]
Vundac, Pfeifhofer, et al., 2006
Vundac, V.B.; Pfeifhofer, H.W.; Brantner, A.H.; Males, Z.; Plazibat, M.,
Essential oils of seven Stachys taxa from Croatia,
Biochem. Syst. Ecol., 2006, 34, 12, 875-881, https://doi.org/10.1016/j.bse.2006.04.010
. [all data]
Ziegenbein, Hanssen, et al., 2006
Ziegenbein, F.C.; Hanssen, H.-P.; König, W.A.,
Secondary metabolites from Ganoderma lucidum and Spongiporus leucomallellus,
Phytochemistry, 2006, 67, 2, 202-211, https://doi.org/10.1016/j.phytochem.2005.10.025
. [all data]
Boti J.B., Koukoua G., et al., 2005
Boti J.B.; Koukoua G.; N'Guessan T.Y.; Muselli A.; Bernardini A.F.; Casanova J.,
Composition of the leaf, stem bark and root bark oils of Isolona cooperi investigated by GC (retention index), GC-MS and C-13-NMR spectroscopy,
Phytochem. Anal., 2005, 16, 5, 357-363, https://doi.org/10.1002/pca.857
. [all data]
Cozzani, Muselli, et al., 2005
Cozzani, S.; Muselli, A.; Desjobert, J.-M.; Bernardini, A.-F.; Tomi, F.; Casanova, J.,
Chemical composition of essential oil of Teucrium polium subsp. capitatum (L.) from Corsica,
Flavour Fragr. J., 2005, 20, 4, 436-441, https://doi.org/10.1002/ffj.1463
. [all data]
Dob, Berramdane, et al., 2005
Dob, T.; Berramdane, T.; Dahmane, D.; Chelghoum, C.,
Chemical composition of the needles oil of Pinus canariensis from Algeria,
Chem. Nat. Compd. (Engl. Transl.), 2005, 41, 2, 165-167, https://doi.org/10.1007/s10600-005-0103-1
. [all data]
Fanciullino, Gancel, et al., 2005
Fanciullino, A.-L.; Gancel, A.-L.; Froelicher, Y.; Luro, F.; Ollitrault, P.; Brillouet, J.-M.,
Effects of Nucleo-cytoplasmic Interactions on Leaf Volatile Compounds from Citrus Somatic Diploid Hybrids,
J. Agric. Food Chem., 2005, 53, 11, 4517-4523, https://doi.org/10.1021/jf0502855
. [all data]
Flamini, Luigi Cioni, et al., 2005
Flamini, G.; Luigi Cioni, P.; Morelli, I.,
Composition of the essential oils and in vivo emission of volatiles of four Lamium species from Italy: L. purpureum, L. hybridum, L. bifidum and L. amplexicaule,
Food Chem., 2005, 91, 1, 63-68, https://doi.org/10.1016/j.foodchem.2004.05.047
. [all data]
Gancel, Ollitrault, et al., 2005
Gancel, A.-L.; Ollitrault, P.; Froelicher, Y.; Tomi, F.; Jacquemond, C.; Luro, F.; Brillouet, J.-M.,
Leaf volatile compounds of six citrus somatic allotetraploid hybrids originating from various combinations of lime, lemon, citron, sweet orange, and grapefruit,
J. Agric. Food Chem., 2005, 53, 6, 2224-2230, https://doi.org/10.1021/jf048315b
. [all data]
bin Jantan, Yalvema, et al., 2005
bin Jantan, I.; Yalvema, M.F.; Ahmad, N.W.; Jamal, J.A.,
Insecticidal activities of the leaf oils of eight Cinnamomum species against Aedes aegypti and Aedes albopictus,
Pharm. Biol., 2005, 43, 6, 526-532, https://doi.org/10.1080/13880200500220771
. [all data]
Paolini, Costa, et al., 2005
Paolini, J.; Costa, J.; Bernardini, A.,
Analysis of the essential oil from aerial parts of Eupatorium cannabinum subsp. corsicum (L.) by gas chromatography with electron impact and chemical ionization mass spectrometry,
J. Chromatogr. A, 2005, 1076, 1-2, 170-178, https://doi.org/10.1016/j.chroma.2005.03.131
. [all data]
Pino, Mesa, et al., 2005
Pino, J.A.; Mesa, J.; Muñoz, Y.; Martí, M.P.; Marbot, R.,
Volatile components from mango (Mangifera indica L.) cultivars,
J. Agric. Food Chem., 2005, 53, 6, 2213-2223, https://doi.org/10.1021/jf0402633
. [all data]
Sati and Mathela, 2005
Sati, S.; Mathela, C.S.,
Essential oil composition of Valeriana hardwickii var. arnottiana from the Himalayas,
Flavour Fragr. J., 2005, 20, 3, 299-301, https://doi.org/10.1002/ffj.1415
. [all data]
Smadja, Rondeau, et al., 2005
Smadja, J.; Rondeau, P.; Sing, A.S.C.,
Volatile constituents of five Citrus Petitgrain essential oils from Reunion,
Flavour Fragr. J., 2005, 20, 4, 399-402, https://doi.org/10.1002/ffj.1438
. [all data]
Tchoumbougnang, Zollo, et al., 2005
Tchoumbougnang, F.; Zollo, P.H.A.; Boyom, F.F.; Nyegue, M.A.; Bessière, J.M.; Menut, C.,
Aromatic plants of tropical Central Africa. XLVIII. Comparative study of the essential oils of four Hyptis species from Cameroon: H. lanceolata Poit., H. pectinata (L.) Poit., H. spicigera Lam. and H. suaveolens Poit.,
Flavour Fragr. J., 2005, 20, 3, 340-343, https://doi.org/10.1002/ffj.1441
. [all data]
Verzera, Trozzi, et al., 2005
Verzera, A.; Trozzi, A.; Zappala, M.; Condurso, C.; Cotroneo, A.,
Essential Oil Composition of Citrus meyerii Y. Tan. and Citrus medica L. cv. Diamante and Their Lemon Hybrids,
J. Agric. Food Chem., 2005, 53, 12, 4890-4894, https://doi.org/10.1021/jf047879c
. [all data]
Aligiannis, Kalpoutzakis, et al., 2004
Aligiannis, N.; Kalpoutzakis, E.; Kyriakopoulou, I.; Mitaku, S.; Chinou, I.B.,
Essential oils of Phlomis species growing in Greece: chemical composition and antimicrobial activity,
Flavour Fragr. J., 2004, 19, 4, 320-324, https://doi.org/10.1002/ffj.1305
. [all data]
Antunes, Sevinate-Pinto, et al., 2004
Antunes, T.; Sevinate-Pinto, I.; Barroso, J.G.; Cavaleiro, C.; Salgueiro, L.R.,
Micromorphology of trichomes and composition of essential oil of Teucrium capitatum,
Flavour Fragr. J., 2004, 19, 4, 336-340, https://doi.org/10.1002/ffj.1310
. [all data]
Ceccarini, Macchia, et al., 2004
Ceccarini, L.; Macchia, M.; Flamini, G.; Cioni, P.L.; Caponi, C.; Morelli, I.,
Essential oil composition of Helianthus annuus L. leaves and heads of two cultivated hybride Carlos and Florom 350,
Ind. Crops Prod., 2004, 19, 1, 13-17, https://doi.org/10.1016/S0926-6690(03)00076-1
. [all data]
Dugo, Mondello, et al., 2004
Dugo, P.; Mondello, L.; Zappia, G.; Bonaccorsi, I.; Cotroneo, A.; Russo, M.T.,
The composition of the volatile fraction and the enantiomeric distribution of five volatile components of faustrime oil (Monocitrus australatica x Fortunella sp. x Citrus aurantifolia),
J. Essent. Oil Res., 2004, 16, 4, 328-333, https://doi.org/10.1080/10412905.2004.9698734
. [all data]
Gonny, Bradesi, et al., 2004
Gonny, M.; Bradesi, P.; Casanova, J.,
Identification of the components of the essential oil from wild Corsican Daucus carota L. using 13C-NMR spectroscopy,
Flavour Fragr. J., 2004, 19, 5, 424-433, https://doi.org/10.1002/ffj.1330
. [all data]
Grujic-Jovanovic, Skaltsa, et al., 2004
Grujic-Jovanovic, S.; Skaltsa, H.D.; Marin, P.; Sokovic, M.,
Composition and antibacterial activity of the essential oil of six Stachys species from Serbia,
Flavour Fragr. J., 2004, 19, 2, 139-144, https://doi.org/10.1002/ffj.1275
. [all data]
Ngassoum, Ousmaila, et al., 2004
Ngassoum, M.B.; Ousmaila, H.; Ngamo, L.T.; Maponmetsem, P.M.; Jirovetz, L.; Buchbauer, G.,
Aroma compounds of essential oils of two varieties of the spice plant Ocimum canum Sims from northern Cameroon,
J. Food Comp. Anal., 2004, 17, 2, 197-204, https://doi.org/10.1016/j.jfca.2003.08.002
. [all data]
Stashenko, Jaramillo, et al., 2004
Stashenko, E.E.; Jaramillo, B.E.; Martínez, J.R.,
Analysis of volatile secondary metabolites from Colombian Xylopia aromatica (Lamarck) by different extraction and headspace methods and gas chromatography,
J. Chromatogr. A, 2004, 1025, 1, 105-113, https://doi.org/10.1016/j.chroma.2003.10.059
. [all data]
Tzakou, Vagias, et al., 2004
Tzakou, O.; Vagias, C.; Gani, A.; Yannitsaros, A.,
Volatile constituents of essential oils isolated at different growth stages from three Conyza species growing in Greece,
Flavour Fragr. J., 2004, 19, 425-428. [all data]
bin Ahmad and bin Jantan, 2003
bin Ahmad, F.; bin Jantan, I.,
Chemical constituents of the essential oils of Goniothalamus uvariodes King,
Flavour Fragr. J., 2003, 18, 2, 128-130, https://doi.org/10.1002/ffj.1142
. [all data]
bin Ahmad and bin Jantan, 2003, 2
bin Ahmad, F.; bin Jantan, I.,
The essential oils of Boesenbergia stenophylla R. M. Sm. as natural sources of methyl (E)-cinnamate,
Flavour Fragr. J., 2003, 18, 6, 485-486, https://doi.org/10.1002/ffj.1227
. [all data]
Bader, Caponi, et al., 2003
Bader, A.; Caponi, C.; Cioni, P.L.; Flamini, G.; Morelli, I.,
Composition of the essential oil of Ballota undulata, B. nigra ssp. foetida and B. saxatilis,
Flavour Fragr. J., 2003, 18, 6, 502-504, https://doi.org/10.1002/ffj.1257
. [all data]
Bianchini, Tomi, et al., 2003
Bianchini, A.; Tomi, P.; Bernardini, A.F.; Morelli, I.; Flamini, G.; Cioni, P.L.; Usai, M.; Marchetti, M.,
A comparative study of volatile constituents of two Helichrysum italicum (Roth) Guss. Don Fil subspecies growing in Corsica (France), Tuscany and Sardinia (Italy),
Flavour Fragr. J., 2003, 18, 6, 487-491, https://doi.org/10.1002/ffj.1231
. [all data]
Bougatsos, Meyer, et al., 2003
Bougatsos, C.; Meyer, J.J.M.; Magiatis, P.; Vagias, C.; Chinou, I.B.,
Composition and antimicrobial activity of the essential oils of Helichrysum kraussii Sch. Bip. and H. rugulosum Less. from south Africa,
Flavour Fragr. J., 2003, 18, 1, 48-51, https://doi.org/10.1002/ffj.1152
. [all data]
Cavalli, Tomi, et al., 2003
Cavalli, J.-F.; Tomi, F.; Bernardini, A.-F.; Casanova, J.,
Composition and chemical variability of the bark oil of Cedrelopsis grevei H. Baillon from Madagascar,
Flavour Fragr. J., 2003, 18, 6, 532-538, https://doi.org/10.1002/ffj.1263
. [all data]
Ceva-Antunes, Bizzo, et al., 2003
Ceva-Antunes, P.M.N.; Bizzo, H.R.; Alves, S.M.; Antunes, O.A.C.,
Analysis of volatile compounds of taperebá (Spondias mombin L.) and Cajá (Spondias mombin L.) by simultaneous distillation and extraction (SDE) and solid phase microextraction (SPME),
J. Agric. Food Chem., 2003, 51, 5, 1387-1392, https://doi.org/10.1021/jf025873m
. [all data]
Ertugrul, Dural, et al., 2003
Ertugrul, K.; Dural, H.; Tugay, O.; Flamini, G.; Cioni, P.L.; Morelli, I.,
Essential oils from flowers of Centaurea kotschyi var. kotschyi and C. kotschyi var. decumbens from Turkey,
Flavour Fragr. J., 2003, 18, 2, 95-97, https://doi.org/10.1002/ffj.1168
. [all data]
Gancel, Ollitrault, et al., 2003
Gancel, A.-L.; Ollitrault, P.; Froelicher, Y.; Tomi, F.; Jacquemond, C.; Luro, F.; Brillouet, J.-M.,
Leaf volatile compounds of seven citrus somatic tetraploid hybrids sharing willow leaf mandarin (Citrus deliciosa Ten.) as their common parent,
J. Agric. Food Chem., 2003, 51, 20, 6006-6013, https://doi.org/10.1021/jf0345090
. [all data]
Shao, Marriott, et al., 2003
Shao, Y.; Marriott, P.; Shellie, R.; Hügel, H.,
Solid-phase micro-extraction-comprehensive two-dimensional gas chromatography of ginger (Zingiber officinale) volatiles,
Flavour Fragr. J., 2003, 18, 1, 5-12, https://doi.org/10.1002/ffj.1133
. [all data]
Skaltsa, Demetzos, et al., 2003
Skaltsa, H.D.; Demetzos, C.; Lazari, D.; Sokovic, M.,
Essential oil analysis and antimicrobial activity of eight Stachys species from Greece,
Phytochemistry, 2003, 64, 3, 743-752, https://doi.org/10.1016/S0031-9422(03)00386-8
. [all data]
Tzakou, Couladis, et al., 2003
Tzakou, O.; Couladis, M.; Slavkovska, V.; Mimica-Dukic, N.; Jancic, R.,
The essential oil composition of Salvia brachyodon Vandas,
Flavour Fragr. J., 2003, 18, 1, 2-4, https://doi.org/10.1002/ffj.1132
. [all data]
Verzera, Trozzi, et al., 2003
Verzera, A.; Trozzi, A.; Gazea, F.; Cicciarelloi, G.; Cotroneo, A.,
Effects of rootstock on the composition of bergamot (Citrus bergamia Risso et Poiteau) essential oil,
J. Agric. Food Chem., 2003, 51, 1, 206-210, https://doi.org/10.1021/jf0206872
. [all data]
Flamini, Cioni, et al., 2002
Flamini, G.; Cioni, P.L.; Morelli, I.,
Analysis of the essential oil of the aerial parts of Viola etrusca from Monte Labbro (South Tuscany, Italy) and in vivo analysis of flower volatiles using SPME,
Flavour Fragr. J., 2002, 17, 2, 147-149, https://doi.org/10.1002/ffj.1060
. [all data]
Heinrich, Pfeifhofer, et al., 2002
Heinrich, G.; Pfeifhofer, H.W.; Stabentheiner, E.; Sawidis, T.,
Glandular hairs of Sigesbeckia jorullensis Kunth (Asteraceae): morphology, histochemistry and composition of essential oil,
Ann. Bot. Rome, 2002, 89, 4, 459-469, retrieved from http://www.aob.oupjournals.org, https://doi.org/10.1093/aob/mcf062
. [all data]
bin Jantan and bin Ahmad, 2002
bin Jantan, I.; bin Ahmad, F.,
Chemical constituents of the essential oils of Goniothalamus malayanus Hook. f. and Thoms.,
Flavour Fragr. J., 2002, 17, 5, 372-374, https://doi.org/10.1002/ffj.1107
. [all data]
Lota, de Rocca Serra, et al., 2002
Lota, M.-L.; de Rocca Serra, D.; Tomi, F.; Jacquemond, C.; Casanova, J.,
Volatile components of peel and leaf oils of lemon and lime species,
J. Agric. Food Chem., 2002, 50, 4, 796-805, https://doi.org/10.1021/jf010924l
. [all data]
Mondello, Zappia, et al., 2002
Mondello, L.; Zappia, G.; Cotroneo, A.; Bonaccorsi, I.; Chowdhury, J.U.; Yusuf, M.; Dugo, G.,
Studies on the essential oil-bearing plants of Bangladesh. Part VIII. Composition of some Ocimum oils O. basilicum L. var. purpurascens; O. sanctum L. green; O. sanctum L. purple; O. americanum L., citral type; O. americanum L., camphor type,
Flavour Fragr. J., 2002, 17, 5, 335-340, https://doi.org/10.1002/ffj.1108
. [all data]
Nath, Sarma, et al., 2002
Nath, S.C.; Sarma, K.K.; Vajezikova, I.; Leclercq, P.A.,
Comparison of volatile inflorescence oils and taxonomy of certain Cymbopogon taxa described as Cymbopogon flexuosus (Nees ex Steud.) Wats.,
Biochem. Syst. Ecol., 2002, 30, 2, 151-162, https://doi.org/10.1016/S0305-1978(01)00066-7
. [all data]
Pitarokili, Couladis, et al., 2002
Pitarokili, D.; Couladis, M.; Petsikos-Panayotarou, N.; Tzakou, O.,
Composition and antifungal activity on soil-borne pathogens of the essential oil of Salvia sclarea from Greece,
J. Agric. Food Chem., 2002, 50, 23, 6688-6691, https://doi.org/10.1021/jf020422n
. [all data]
Shellie, Mondello, et al., 2002
Shellie, R.; Mondello, L.; Marriott, P.; Dugo, G.,
Characterisation of lavender essential oils by using gas chromatography-mass spectrometry with correlation of linear retention indices and comparison with comprehensive two-dimensional gas chromatography,
J. Chromatogr. A, 2002, 970, 1-2, 225-234, https://doi.org/10.1016/S0021-9673(02)00653-2
. [all data]
Aligiannis, Kalpoutzakis, et al., 2001
Aligiannis, N.; Kalpoutzakis, E.; Chinou, I.B.; Mitaku, S.; Gikas, E.; Tsarbopoulos, A.,
Composition and antimicrobial activity of the essential oils of five taxa of Sideritis from Greece,
J. Agric. Food Chem., 2001, 49, 2, 811-815, https://doi.org/10.1021/jf001018w
. [all data]
Bianchini, Tomi, et al., 2001
Bianchini, A.; Tomi, P.; Costa, J.; Bernardini, A.F.,
Composition of Helichrysum italicum (Roth) G. Don fil. subsp. italicum essential oils from Corsica (France),
Flavour Fragr. J., 2001, 16, 1, 30-34, https://doi.org/10.1002/1099-1026(200101/02)16:1<30::AID-FFJ941>3.0.CO;2-F
. [all data]
Bortolomeazzi, Berno, et al., 2001
Bortolomeazzi, R.; Berno, P.; Pizzale, L.; Conte, L.S.,
Sesquiterpene, alkene, and alkane hydrocarbons in virgin olive oils of different varieties and geographical origins,
J. Agric. Food Chem., 2001, 49, 7, 3278-3283, https://doi.org/10.1021/jf001271w
. [all data]
Lota, Serra, et al., 2001
Lota, M.-L.; Serra, D.R.; Jacquemond, C.; Tomi, F.; Casanova, J.,
Chemical variability of peel and leaf essential oils of sour orange,
Flavour Fragr. J., 2001, 16, 2, 89-96, https://doi.org/10.1002/1099-1026(200103/04)16:2<89::AID-FFJ950>3.0.CO;2-D
. [all data]
Skaltsa, Mavrommati, et al., 2001
Skaltsa, H.D.; Mavrommati, A.; Constantinidis, T.,
A chemotaxonomic investigation of volatile constituents in Stachys subsect. Swainsonianeae (Labiatae),
Phytochemistry, 2001, 57, 2, 235-244, https://doi.org/10.1016/S0031-9422(01)00003-6
. [all data]
Bortolomeazzi, Pizzale, et al., 2000
Bortolomeazzi, R.; Pizzale, L.; Vichi, S.; Piasenzotto, L.; Conte, L.S.,
GC-MS Characterization of sesquiterpenic hydrocarbons in virgin olive oils, Proceedings 23rd ISCC; CD-ROM, 2000, retrieved from http://www.richrom.com/assets/CD23PDF. [all data]
Mondello, Zappia, et al., 2000
Mondello, L.; Zappia, G.; Dugo, P.; Dugo, G.; Bonaccorsi, I.; Dugo, G.,
Identification of complex samples by Fast-GC/MS using linear retention indices in conjunction with the MS-library, Proceedings, 23rd ISCC; CD-ROM, 2000, retrieved from http://www.richrom.com/assets/CD23PDF. [all data]
Verzera, la Rosa, et al., 2000
Verzera, A.; la Rosa, G.; Zappalà, M.; Cotroneo, A.,
Essential oil composition of different cultivars of bergamot grown in Sicily,
Ital. J. Food Sci., 2000, 12, 4, 493-501. [all data]
Verzera, Trozzi, et al., 2000
Verzera, A.; Trozzi, A.; Cotroneo, A.; Lorenzo, D.; Dellacassa, E.,
Uruguayan essential oil. 12. Composition of Nova and Satsuma mandarin oils,
J. Agric. Food Chem., 2000, 48, 7, 2903-2909, https://doi.org/10.1021/jf990734z
. [all data]
Lota, Serra, et al., 1999
Lota, M.-L.; Serra, D.R.; Tomi, F.; Bessiere, J.-M.; Casanova, J.,
Chemical composition of peel and leaf essential oils of Citrus medica L. and C. limonimedica Lush.,
Flavour Fragr. J., 1999, 14, 3, 161-166, https://doi.org/10.1002/(SICI)1099-1026(199905/06)14:3<161::AID-FFJ801>3.0.CO;2-8
. [all data]
Mazzoni, Tomi, et al., 1999
Mazzoni, V.; Tomi, F.; Casanova, J.,
A daucane-type sesquiterpene from Faucus carota seed oil,
Flavour Fragr. J., 1999, 14, 5, 268-272, https://doi.org/10.1002/(SICI)1099-1026(199909/10)14:5<268::AID-FFJ823>3.0.CO;2-Z
. [all data]
Sagrero-Nieves, Bartley, et al., 1997
Sagrero-Nieves, L.; Bartley, J.P.; Griselda Espinosa, B.; Dominguez, X.A.; Julia Verde S.,
Essential oil composition of Aristolochia brevipes Benth.,
Flavour Fragr. J., 1997, 12, 6, 401-403, https://doi.org/10.1002/(SICI)1099-1026(199711/12)12:6<401::AID-FFJ673>3.0.CO;2-D
. [all data]
Andriamaharavo, 2014
Andriamaharavo, N.R.,
Retention Data. NIST Mass Spectrometry Data Center., NIST Mass Spectrometry Data Center, 2014. [all data]
Cardeal, da Silva, et al., 2006
Cardeal, Z.L.; da Silva, M.D.R.G.; Marriott, P.J.,
Comprehensive two-dimensional gas chromatography/mass spectrometric analysis of pepper volatiles,
Rapid Commun. Mass Spectrom., 2006, 20, 19, 2823-2836, https://doi.org/10.1002/rcm.2665
. [all data]
Guerrini, Sacchetti, et al., 2006
Guerrini, A.; Sacchetti, G.; Muzzoli, M.; Rueda, G.M.; Medici, A.; Besco, E.; Bruni, R.,
Composition of the Volatile Fraction of Ocotea bofo Kunth (Lauraceae) Calyces by GC-MS and NMR Fingerprinting and Its Antimicrobial and Antioxidant Activity,
J. Agric. Food Chem., 2006, 54, 20, 7778-7788, https://doi.org/10.1021/jf0605493
. [all data]
Díaz-Maroto, Sánchez Palomo, et al., 2004
Díaz-Maroto, M.C.; Sánchez Palomo, E.; Castro, L.; González Viñas, M.A.; Pérez-Coello, M.S.,
Changes produced in the aroma compounds and structural integrity of basil (Ocimum basilicum L) during drying,
J. Sci. Food Agric., 2004, 84, 15, 2070-2076, https://doi.org/10.1002/jsfa.1921
. [all data]
Lorenzo, Loayza, et al., 2003
Lorenzo, D.; Loayza, I.; Dellacassa, E.,
Composition of the essential oils from leaves of two Hedyosmum spp. from Bolivia,
Flavour Fragr. J., 2003, 18, 1, 32-35, https://doi.org/10.1002/ffj.1146
. [all data]
Boulanger, Chassagne, et al., 1999
Boulanger, R.; Chassagne, D.; Crouzet, J.,
Free and bound flavour components of amazonian fruits. 1: Bacuri,
Flavour Fragr. J., 1999, 14, 5, 303-311, https://doi.org/10.1002/(SICI)1099-1026(199909/10)14:5<303::AID-FFJ834>3.0.CO;2-C
. [all data]
Elmore, Erbahadir, et al., 1997
Elmore, J.S.; Erbahadir, M.A.; Mottram, D.S.,
Comparison of dynamic headspace concentration on Tenax with solid phase microextraction for the analysis of aroma volatiles,
J. Agric. Food Chem., 1997, 45, 7, 2638-2641, https://doi.org/10.1021/jf960835m
. [all data]
Kjeldsen, Christensen, et al., 2003
Kjeldsen, F.; Christensen, L.P.; Edelenbos, M.,
Changes in volatile compounds of carrots (Daucus carota L.) during refrigerated and frozen storage,
J. Agric. Food Chem., 2003, 51, 18, 5400-5407, https://doi.org/10.1021/jf030212q
. [all data]
Klesk, Qian, et al., 2004
Klesk, K.; Qian, M.; Martin, R.R.,
Aroma extract dilution analysis of cv. meeker (Rubus idaeus L.) red raspberries from Oregon and Washington,
J. Agric. Food Chem., 2004, 52, 16, 5155-5161, https://doi.org/10.1021/jf0498721
. [all data]
Thompson, Baker, et al., 1971
Thompson, A.C.; Baker, D.N.; Gueldner, R.C.; Hedin, P.A.,
Identification and Quantitative Analysis of the Volatile Substances Emitted by Maturing Cotton in the Field,
Plant Physiol., 1971, 48, 1, 50-52, https://doi.org/10.1104/pp.48.1.50
. [all data]
Rodriques, Amorim, et al., 2013
Rodriques, K.A. da.F.; Amorim, L.V.; de Oliveira, J.M.G.; Dias, C.N.; Moraes, D.F.C.; Andrade, E.H. deA.; Maia, J.G.S.; Carneiro, S.M.P.; Carvalho, F.A. deA.,
Eugenia uniflora L. essential oil as a potential anti-Leishmania agent: effect on Leishmania amazonensis and possible mechanism of action,
Evidence-Based Complementary and Alternative Medicine, 2013, 2013, 1-10, https://doi.org/10.1155/2013/279726
. [all data]
Cao, Li, et al., 2011
Cao, H.; Li, Z.; Chen, X.,
QSRR study of GC retention indices of volatile compounds emitted from Mosla chinensis Maxim. by multiply linear regression,
Chin. J. Chem., 2011, 29, 10, 2187-2196, https://doi.org/10.1002/cjoc.201180379
. [all data]
Baharum, Bunawan, et al., 2010
Baharum, S.N.; Bunawan, H.; Ghani, M.A.; Mustafa, W.A.W.; Noor, N.M.,
Analysis of the chemical composition of the essential oil of Polygonum minus Huds. using two-dimensional gas chromatography - time of flight mass spectrometry (GC-TOF-MS),
Molecules, 2010, 15, 10, 7006-7015, https://doi.org/10.3390/molecules15107006
. [all data]
Dib, Djabou, et al., 2010
Dib, M.ElA.; Djabou, N.; Desjobert, L.-M.; Allali, H.; Tabti, B.; Muselli, A.; Costa, J.,
Characterization of volatile compounds of Daucus crinitus Desf. headspace solid phase microextraction as alternative technique to hydrodistillation,
Chem, Centr. J., 2010, 4, 16, 1-15. [all data]
Lazarevic, Radulovic, et al., 2010
Lazarevic, J.; Radulovic, N.; Palic, R.; Zlatkovic, B.,
Chemical Analusis of volatile constituents of Berula erecta (Hudson) Coville subsp. erecta (Apiaceae) from Serbia,
J. Essential Oil. Res., 2010, 22, 3, 153-156, https://doi.org/10.1080/10412905.2010.9700290
. [all data]
Radulovic, Dordevic, et al., 2010
Radulovic, N.S.; Dordevic, N.D.; Palic, R.M.,
Volatiles of Pleurospermum austriacum (L.) Hoffm. (Apiaceae),
J. Serbian Chem. Soc., 2010, 75, 12, 1-11, https://doi.org/10.2298/JSC100323127R
. [all data]
Gilani, Shah, et al., 2009
Gilani, A.H.; Shah, A.J.; Zubair, A.; Khalid, S.; Kiani, J.; Ahmed, A.; Rasheed, M.; Ahmad, V.U.,
Chemical composition and mechanisms underlying the spasmolytic and bronchodilatory properties of the essential oil of Nepeta cataria L.,
J. Ethnopharmacology, 2009, 121, 3, 405-411, https://doi.org/10.1016/j.jep.2008.11.004
. [all data]
Ottavioli, Bighelli, et al., 2009
Ottavioli, J.; Bighelli, A.; Casanova, J.; Bang, B.T.; Y.,
GC (retention indices), GC-MS, and 13C NMR of two citral-rich Cymbopogon leaf oils: C. Flexuosus and C. tortilis,
Spectroscopy Lett., 2009, 42, 8, 506-512, https://doi.org/10.1080/00387010903022350
. [all data]
Patil, Jayaprakasha, et al., 2009
Patil, J.R.; Jayaprakasha, G.K.; Murthy, K.N.C.; Tichy, S.E.; Chetti, M.B.; Patil, B.S.,
Apoptosis-mediated proliferation inhibition of human colon cancer cells by volatile principles of Citrus auratifolia,
Food Chem., 2009, 114, 4, 1351-1358, https://doi.org/10.1016/j.foodchem.2008.11.033
. [all data]
Porto, Decorti, et al., 2009
Porto, C.Da.; Decorti, D.; Kikic, I.,
Flavour compounds of Lavandula angustifolia L. to use in food manufacturing: comparison of three different extraction methods,
Food Chem., 2009, 112, 4, 1072-1078, https://doi.org/10.1016/j.foodchem.2008.07.015
. [all data]
Bouwmeester, de Kraker, et al., 2008
Bouwmeester, H.J.; de Kraker, J.-W.; Schurink, M.; Bino, R.J.; de Groot, A.,
Plant Enzymes for Bioconversion, 2008, 57. [all data]
Khokra, Prakash, et al., 2008
Khokra, S.L.; Prakash, O.; Jain, S.; Aneja, K.R.; Dhingra, Y.,
Essential oil composition and antibacterial studies of Vitex negundo Linn. extracts,
Indian J. Pharm. Sci., 2008, 70, 4, 522-526, https://doi.org/10.4103/0250-474X.44610
. [all data]
Lo Presti, Sciarrone, et al., 2008
Lo Presti, M.; Sciarrone, D.; Crupi, M.C.; Costa, R.; Ragusa, S.; Dugo, G.; Mondello, L.,
Evaliation of the volatile and chiral composition in Pistacia lentiscus L. essential oil,
Flavour Fragr. J., 2008, 23, 4, 249-257, https://doi.org/10.1002/ffj.1878
. [all data]
Sahraoui, Vian, et al., 2008
Sahraoui, N.; Vian, M.A.; Bornard, I.; Boutekedjiret, C.; Chemat, F.,
Improved microwave steam distillation apparatus for isolation of essential oils. Comparison with conventional steam distillation,
J. Chromatogr. A., 2008, 1210, 2, 229-233, https://doi.org/10.1016/j.chroma.2008.09.078
. [all data]
Bos, Woerdenbag, et al., 2007
Bos, R.; Woerdenbag, H.J.; Kayser, O.; Quax, W.J.; Ruslan, K.; Elfami,
Essential oil constituents of Piper cubeba L. fils. from Indonesia,
J. Essent. Oil Res., 2007, 19, 1, 14-17, https://doi.org/10.1080/10412905.2007.9699217
. [all data]
Elfami, Bos, et al., 2007
Elfami; Bos, R.; Ruslan, K.; Woerdenbag, H.J.; Kayser, P.; Quax, W.J.,
Essential Oil Constituents of Piper cubeba from Indonesia, 2007, 53-60. [all data]
Ferhat, Meklati, et al., 2007
Ferhat, M.A.; Meklati, B.Y.; Chemat, F.,
Comparison of different isolation methods of essential oil from Citrus fruits: cold pressing, hydrodistillation and microwave dry distillation,
Flavour Fragr. J., 2007, 22, 6, 494-504, https://doi.org/10.1002/ffj.1829
. [all data]
Ferhat, Tigrine-Kordjani, et al., 2007
Ferhat, M.A.; Tigrine-Kordjani, N.; Chemat, S.; Meklati, B.Y.; Chemat, F.,
Rapid Extraction of Volatile Compounds Using a New Simultaneous Microwave Distillation: Solvent Extraction Device,
Chromatographia, 2007, 65, 3-4, 217-222, https://doi.org/10.1365/s10337-006-0130-5
. [all data]
Gudaityte and Venskutonis R.P., 2007
Gudaityte, O.; Venskutonis R.P.,
Chemotypes of Achillea millefolium transferred from 14 different locations in Lithuania to the controlled environment,
Biochem. Syst. Ecol., 2007, 35, 9, 582-592, https://doi.org/10.1016/j.bse.2007.03.016
. [all data]
Meccia, Rojas, et al., 2007
Meccia, G.; Rojas, L.B.; Velasco, J.; Diaz, T.; Usubillaga, A.,
Composition and antibacterial screening of the essential oils of leaves and roots of Espeletiopsis angustifolia Cuetrec,
Natural Product Communications, 2007, 2, 12, 1221-1224. [all data]
Miyazawa and Tamura, 2007
Miyazawa, M.; Tamura, N.,
Components of the essential oil from sprouts of Polygonum hydropiper L. ('Benitade'),
Flavour Fragr. J., 2007, 22, 3, 188-190, https://doi.org/10.1002/ffj.1779
. [all data]
Morteza-Semnani, Saeedi, et al., 2007
Morteza-Semnani, K.; Saeedi, M.; Akbarzadeh, M.,
Essential oil composition of Teucrium scordium L.,
Acta Pharm., 2007, 57, 4, 499-504, https://doi.org/10.2478/v10007-007-0040-6
. [all data]
Oliveira, Leitão, et al., 2007
Oliveira, D.R.; Leitão, G.G.; Bizzo, H.R.; Lopes, D.; Alviano, D.S.; Alviano, C.S.; Leitão, S.G.,
Chemical and antimicrobial analyses of essential oil of Lippia origanoides H.B.K,
Food Chem., 2007, 101, 1, 236-240, https://doi.org/10.1016/j.foodchem.2006.01.022
. [all data]
Ozcan and Chalchat, 2007
Ozcan, M.M.; Chalchat, J.C.,
Chemical Composition od Carrot Seeds (Daucus carota L.) Cultivated in Turkey: Characterization of the Seed Oil and Essential Oil,
Grasas y Aceites, 2007, 58, 4, 359-365. [all data]
Pala-Paul, Brophy, et al., 2007
Pala-Paul, J.; Brophy, J.J.; Perez-Alonso, M.J.; Usano, J.; Soria, S.C.,
Essential oil composition of the different parts of Eryngium corniculatum Lam. (Apiaceae) from Spain,
J. Chromatogr. A, 2007, 1175, 2, 289-293, https://doi.org/10.1016/j.chroma.2007.10.061
. [all data]
Ristic, Krivokuca-Dokic, et al., 2007
Ristic, M.; Krivokuca-Dokic, D.; Radanovic, D.; Nastovski, T.,
Etarsko ulje Arnica montata i Arnica chamissonis,
Hem. Ind., 2007, 61, 5, 272-277, https://doi.org/10.2298/HEMIND0704272R
. [all data]
Askari and Sefidkon, 2006
Askari, F.; Sefidkon, F.,
Essential oil composition of Pimpinella affinis Ledeb. from two localities in Iran,
Flavour Fragr. J., 2006, 21, 5, 754-756, https://doi.org/10.1002/ffj.1619
. [all data]
Ayoub, Al-Azizi, et al., 2006
Ayoub, N.; Al-Azizi, M.; König, W.; Kubeczka, K.-H.,
Essential oils and a novel polyacetylene from Eryngium yuccifolium Michaux. (Apiaceae),
Flavour Fragr. J., 2006, 21, 6, 864-868, https://doi.org/10.1002/ffj.1631
. [all data]
Bazargani, Almasirad, et al., 2006
Bazargani, Y.T.; Almasirad, A.; Amin, G.; Shafiee, A.,
Chemical composition of the essential oils of Astrodaucus persicus (Boiss.) Drude root, stem/leaves and flowers/fruits,
Flavour Fragr. J., 2006, 21, 2, 294-296, https://doi.org/10.1002/ffj.1589
. [all data]
Elfami, Komar, et al., 2006
Elfami, R.B.; Komar, R.; Woerdenbag, H.J.; Kayser, P.; Quax, W.J.,
Essential oil constituents of Piper cubeba from Indonesia, 2006, retrieved from http://dissertations.ub.rug.nl/FILES/facultiew/science/2006/elfahmi/05c5.pdf. [all data]
Figuérédo, Cabassu, et al., 2006
Figuérédo, G.; Cabassu, P.; Chalchat, J.-C.; Pasquier, B.,
Studies of Mediterranean oregano populations. VIII. Chemical composition of essential oils of oreganos of various origins,
Flavour Fragr. J., 2006, 21, 1, 134-139, https://doi.org/10.1002/ffj.1543
. [all data]
Garneau F.X., Collin G., et al., 2006
Garneau F.X.; Collin G.; Gagnon H.; Jean F.I.; Strobl H.; Pichette A.,
The essential oil composition of Devil's Club, Oplopanax horridus J. E. Smith Miq.,
Flavour Fragr. J., 2006, 21, 5, 792-794, https://doi.org/10.1002/ffj.1716
. [all data]
Kula, Izydorczyk, et al., 2006
Kula, J.; Izydorczyk, K.; Czajkowska, A.; Bonikowski, R.,
Chemical composition of carrot umbel oils from Daucus carota L. ssp. sativus cultivated in Poland,
Flavour Fragr. J., 2006, 21, 4, 667-669, https://doi.org/10.1002/ffj.1646
. [all data]
Kurowska and Galazka, 2006
Kurowska, A.; Galazka, I.,
Essential oil composition of the parsley seed of cultivars marketed in Poland,
Flavour Fragr. J., 2006, 21, 1, 143-147, https://doi.org/10.1002/ffj.1548
. [all data]
Navaei and Mirza, 2006
Navaei, M.N.; Mirza, M.,
Chemical composition of the oil of Eremostachys laciniata (L.) Bunge from Iran,
Flavour Fragr. J., 2006, 21, 4, 645-646, https://doi.org/10.1002/ffj.1635
. [all data]
Ouamba, Ouabonzi, et al., 2006
Ouamba, J.-M.; Ouabonzi, A.; Ekouya, A.; Bessière, J.-M.; Menut, C.; Abena, A.A.; Banzouzi, J.-T.,
Volatile constituents of the essential oil leaf of Lantana salvifolia Jacq. (Verbenaceae),
Flavour Fragr. J., 2006, 21, 1, 158-161, https://doi.org/10.1002/ffj.1553
. [all data]
Pala-Paul J., Perez-Alonso M.J., et al., 2006
Pala-Paul J.; Perez-Alonso M.J.; Velasco-Negueruela A.; Ballesteros M.T.; Sanz J.,
Essential oil composition of Sideritis hirsuta L. from Guadalajara Province, Spain,
Flavour Fragr. J., 2006, 21, 3, 410-415, https://doi.org/10.1002/ffj.1727
. [all data]
Potzernheim, Bizzo, et al., 2006
Potzernheim, M.C.L.; Bizzo, H.R.; Vieira, R.F.,
Analysis of the essential oil of three species of Piper collected in the region of the Distrito Federal (Cerrado - Brazilian Savannah) and comparison with oils of plants from region of Paraty, State of Rio de Janeiro (Atlantic Rain Forest),
Brazilian Journal of Pharmacognosy, 2006, 16, 2, 246-251. [all data]
Rout, Naik, et al., 2006
Rout, P.K.; Naik, S.N.; Rao, Y.R.,
Composition of the concrete, absolute, headspace and essential oil of the flowers of Michelia champaca Linn.,
Flavour Fragr. J., 2006, 21, 6, 906-911, https://doi.org/10.1002/ffj.1742
. [all data]
Sajjadi, 2006
Sajjadi, S.E.,
Analysis of the essential oils of two cultivated basil (Icimum basilicum L.) from Iran,
DARU, 2006, 14, 3, 128-130. [all data]
Senatore, Landolfi, et al., 2006
Senatore, F.; Landolfi, S.; Celik, S.; Bruno, M.,
Volatile components of Centaurea calcitrapa L. and Centaurea sphaerocephala L. ssp. sphaerocephala, two Asteraceae growing wild in Sicily,
Flavour Fragr. J., 2006, 21, 2, 282-285, https://doi.org/10.1002/ffj.1585
. [all data]
Tesso, König, et al., 2006
Tesso, H.; König, W.A.; Son, P.T.; Giang, P.M.,
Composition of the essential oil of flowers of Chloranthus spicatus (Thunb.) Makino,
Flavour Fragr. J., 2006, 21, 4, 592-597, https://doi.org/10.1002/ffj.1528
. [all data]
Busman, Zoghbi, et al., 2005
Busman, D.V.; Zoghbi, M.G.B.; Potiguara, R.C.V.; Andrade, E.H.A.,
Volatiles from different organs of Unxia camphorata L. f. growing wild in the Amazon,
Biochem. Syst. Ecol., 2005, 33, 12, 1269-1273, https://doi.org/10.1016/j.bse.2005.07.001
. [all data]
Chagonda and Chalchat, 2005
Chagonda, L.S.; Chalchat, J.-C.,
The essential oil of wild and cultivated Hoslundia opposita Vahl. from Zimbabwe,
Flavour Fragr. J., 2005, 20, 2, 193-195, https://doi.org/10.1002/ffj.1402
. [all data]
Chaverri and Cicció, 2005
Chaverri, C.; Cicció, J.F.,
Essential oil of trees of the genus Ocotea (Lauraceae) in Costa Rica. I. Ocotea brenesii,
Rev. Biol. Trop., 2005, 53, 3-4, 431-436, https://doi.org/10.15517/rbt.v53i3-4.14611
. [all data]
Dötterl, Wolfe, et al., 2005
Dötterl, S.; Wolfe, L.M.; Jürgens, A.,
Qualitative and quantitative analyses of flower scent in Silene latifolia,
Phytochemistry, 2005, 66, 2, 203-213, https://doi.org/10.1016/j.phytochem.2004.12.002
. [all data]
Fakhari A.R., Sonboli A., et al., 2005
Fakhari A.R.; Sonboli A.; Heydari R.,
Composition of the essential oil of Rhabdosciadium strausii from Iran,
Chem. Nat. Compd. (Engl. Transl.), 2005, 41, 4, 413-414, https://doi.org/10.1007/s10600-005-0164-1
. [all data]
Ferraz, Limberger, et al., 2005
Ferraz, A.B.F.; Limberger, R.P.; Bordignon, S.A.L.; von Poser, G.L.; Henriques, A.T.,
Essential oil composition of six Hypericum species from southern Brazil,
Flavour Fragr. J., 2005, 20, 3, 335-339, https://doi.org/10.1002/ffj.1435
. [all data]
Figuérédo, Cabassu, et al., 2005
Figuérédo, G.; Cabassu, P.; Chalchat, J.-C.; Pasquier, B.,
Studies of Mediterranean oregano populations- V. Chemical composition of essential oils of oregano: Origanum syriacum L. var. bevanii (Holmes) Ietswaart, O. syriacum L. var. sinaicum (Boiss.) Ietswaart, and O. syriacum L. var. syriacum from Lebanon and Israel,
Flavour Fragr. J., 2005, 20, 164-168. [all data]
Gauvin and Smadja, 2005
Gauvin, A.; Smadja, J.,
Essential oil composition of four Psiadia species from Reunion Island: A chemotaxonomic study,
Biochem. Syst. Ecol., 2005, 33, 7, 705-714, https://doi.org/10.1016/j.bse.2004.12.013
. [all data]
Khanavi, Ghasemian, et al., 2005
Khanavi, M.; Ghasemian, L.; Motlagh, E.H.; Hadjiakhoondi, A.; Shafiee, A.,
Chemical composition of the essential oils of Marrubium parviflorum Fisch. C.A. Mey. and Marrubium vulgare L. from Iran,
Flavour Fragr. J., 2005, 20, 3, 324-326, https://doi.org/10.1002/ffj.1425
. [all data]
Kowalski and Wolski, 2005
Kowalski, R.; Wolski, T.,
The chemical composition of essential oils of Silphium perfoliatum L.,
Flavour Fragr. J., 2005, 20, 3, 306-310, https://doi.org/10.1002/ffj.1418
. [all data]
Kowalski, 2005
Kowalski, R.,
Analysis of lipophylic fraction from leaves, inflorescences and rhizomes of Siphium perfoliatum L.,
Acta Soc. Botanicorum Poloniae, 2005, 74, 1, 5-10, https://doi.org/10.5586/asbp.2005.001
. [all data]
Marongiu, Piras, et al., 2005
Marongiu, B.; Piras, A.; Porcedda, S.; Scorciapino, A.,
Chemical composition of the essential oil and supercritical CO2 extract of Commiphora myrrha (Nees) Engl. and of Acorus calamus L.,
J. Agric. Food Chem., 2005, 53, 20, 7939-7943, https://doi.org/10.1021/jf051100x
. [all data]
Morteza-Semnani, Akbarzadeh, et al., 2005
Morteza-Semnani, K.; Akbarzadeh, M.; Rostami, B.,
The essential oil composition of Teucrium chamaedrys L. from Iran,
Flavour Fragr. J., 2005, 20, 5, 544-546, https://doi.org/10.1002/ffj.1479
. [all data]
Srivastava, Srivastava, et al., 2005
Srivastava, A.K.; Srivastava, S.K.; Syamsundar, K.V.,
Bud and leaf essential oil composition of Syzygium aromaticum from India and Madagascar,
Flavour Fragr. J., 2005, 20, 1, 51-53, https://doi.org/10.1002/ffj.1364
. [all data]
Tzakou and Constantinidis, 2005
Tzakou, O.; Constantinidis, T.,
Chemotaxonomic significance of volatile compounds in Thymus samius and its related species Thymus atticus and Thymus parnassicus,
Biochem. Syst. Ecol., 2005, 33, 11, 1131-1140, https://doi.org/10.1016/j.bse.2005.03.008
. [all data]
Utsunomia, Kawata, et al., 2005
Utsunomia, H.; Kawata, J.; Chanoki, W.; Shirakawa, N.; Miyazawa, M.,
Components of Essential Oil from Woods of Prunus mume Sieb. at Zucc.,
J. Oleo Sci., 2005, 54, 11, 609-612, https://doi.org/10.5650/jos.54.609
. [all data]
Velasco-Negueruela, Pérez-Alonso, et al., 2005
Velasco-Negueruela, A.; Pérez-Alonso, M.J.; Pérez de Paz, P.L.; Palá-Paúl, J.; Sanz, J.,
Analysis by gas chromatography-mass spectrometry of the essential oils from the aerial parts of Pimpinella anagodendron Bolle and Pimpinella rupicola Svent., two endemic species to the Canary Islands, Spain,
J. Chromatogr. A, 2005, 1095, 1-2, 180-184, https://doi.org/10.1016/j.chroma.2005.09.074
. [all data]
Wong, Lee, et al., 2005
Wong, K.C.; Lee, B.C.; Lam, N.F.; Ibrahim, P.,
Essential oils of the rhizomes of Alpinia conchigera Griff. and Alpinia latilabris Ridl.,
Flavour Fragr. J., 2005, 20, 4, 431-433, https://doi.org/10.1002/ffj.1458
. [all data]
Cicció, 2004
Cicció, J.F.,
A source of almost pure methyl chavicol: volatile oil from the aerial parts of Tagetes lucida (Asteraceae) cultivated in Costa Rica,
Rev. Biol. Trop., 2004, 52, 4, 853-857, retrieved from http://www.tropiweb.com. [all data]
Fekam Boyom, Fotio, et al., 2004
Fekam Boyom, F.; Fotio, D.; Amvam Zollo, P.H.; Agnaniet, H.; Menut, C.; Bessière, J.M.,
Aromatic plants of tropical Central Africa. Part XLIV. Volatile components from Pseudocedrela kotschyi (Schweinf.) harms growing in Cameroon,
Flavour Fragr. J., 2004, 19, 1, 9-11, https://doi.org/10.1002/ffj.1254
. [all data]
Gauvin, Ravaomanarivo, et al., 2004
Gauvin, A.; Ravaomanarivo, H.; Smadja, J.,
Comparative analysis by gas chromatography?mass spectrometry of the essential oils from bark and leaves of Cedrelopsis grevei Baill, an aromatic and medicinal plant from Madagascar,
J. Chromatogr. A, 2004, 1029, 1-2, 279-282, https://doi.org/10.1016/j.chroma.2003.12.012
. [all data]
JAvidnia, Mojab, et al., 2004
JAvidnia, K.; Mojab, F.; Mojahedi, S.A.,
Chemical constituents of the essential oil of Stachys lavandulifolia Vahl from Iran,
Iranian J. Pharm. Res., 2004, 3, 61-63. [all data]
Jürgens and Dötterl, 2004
Jürgens, A.; Dötterl, S.,
Chemical composition of anther volatiles in Ranunculaceae: genera-specific profiles in Aemone, Aquilegia, Caltha, Pulsatilla, Ranunculus, and Trollius species,
American Journal of Botany, 2004, 91, 12, 1969-1980, https://doi.org/10.3732/ajb.91.12.1969
. [all data]
Limberger, Sobral, et al., 2004
Limberger, R.P.; Sobral, M.; Henriques, A.T.; Menut, C.; Bessière, J.-M.,
Óleos voláteis de espécies de Myrcia nativas do rio grande do sul,
Quim. Nova, 2004, 27, 6, 916-919, https://doi.org/10.1590/S0100-40422004000600015
. [all data]
Nik, Mirza, et al., 2004
Nik, Z.B.; Mirza, M.; Shahmir, F.,
Essential oil of Marrubium cuneatum Russell and its secretory elements,
Flavour Fragr. J., 2004, 19, 3, 233-235, https://doi.org/10.1002/ffj.1293
. [all data]
Tirillini, Pellegrino, et al., 2004
Tirillini, B.; Pellegrino, R.; Bini, L.M.,
Essential oil composition of Stachys sylvatica L. from Italy,
Flavour Fragr. J., 2004, 19, 4, 330-332, https://doi.org/10.1002/ffj.1308
. [all data]
Fekam Boyom, Amvam Zollo, et al., 2003
Fekam Boyom, F.; Amvam Zollo, P.H.; Agnaniet, H.; Menut, C.; Bessière, J.M.,
Aromatic plants of tropical central Africa. Part XLIII volatiles components from Uvariastrum pierreanum Engl. (Engl. Diels) growing in Cameroon,
Flavour Fragr. J., 2003, 18, 4, 296-298, https://doi.org/10.1002/ffj.1218
. [all data]
Fekam Boyom, Ngouana, et al., 2003
Fekam Boyom, F.; Ngouana, V.; Amvam Zollo, P.H.; Menut, C.; Bessiere, J.M.; Gut, J.; Rosenthal, P.J.,
Composition and anti-plasmodial activities of essential oils from some Cameroonian medicinal plants,
Phytochemistry, 2003, 64, 7, 1269-1275, https://doi.org/10.1016/j.phytochem.2003.08.004
. [all data]
Fernandez, Lizzani-Cuvelier, et al., 2003
Fernandez, X.; Lizzani-Cuvelier, L.; Loiseau, A.-M.; Périchet, C.; Delbecque, C.,
Volatile constituents of benzoin gums: Siam and Sumatra. Part 1.,
Flavour Fragr. J., 2003, 18, 4, 328-333, https://doi.org/10.1002/ffj.1230
. [all data]
Ghannadi and Zolfaghari, 2003
Ghannadi, A.; Zolfaghari, B.,
Compositional analysis of the essential oil of Lallemantia royleana (Benth. in Wall.) Benth. from Iran,
Flavour Fragr. J., 2003, 18, 3, 237-239, https://doi.org/10.1002/ffj.1215
. [all data]
Kanjilal, Kotoky, et al., 2003
Kanjilal, P.B.; Kotoky, R.; Singh, R.S.,
Chemical composition of the leaf oil of Altingia excelsa Nornha,
Flavour Fragr. J., 2003, 18, 5, 449-450, https://doi.org/10.1002/ffj.1250
. [all data]
Limberger, Simões-Pires, et al., 2003
Limberger, R.P.; Simões-Pires, C.A.; Sobral, M.; Menut, C.; Bessiere, J.-M.; Henriques, A.T.,
Essential oils of six Gomidesia spp. from southern Brazil,
Flavour Fragr. J., 2003, 18, 2, 144-147, https://doi.org/10.1002/ffj.1122
. [all data]
Maia, Taveira, et al., 2003
Maia, J.G.S.; Taveira, F.S.N.; Andrade, E.H.A.; da Silva, M.H.L.; Zoghbi, M.G.B.,
Essential oils of Lippia grandis Schau.,
Flavour Fragr. J., 2003, 18, 5, 417-420, https://doi.org/10.1002/ffj.1241
. [all data]
Marongiu, Porcedda, et al., 2003
Marongiu, B.; Porcedda, S.; Caredda, A.; de Gioannis, B.; Vargiu, L.; la Colla, P.,
Extraction of Juniperus oxycedrus ssp. Oxycedrus essential oil by supercritical carbon dioxide: influence of some process parameters and biological activity,
Flavour Fragr. J., 2003, 18, 5, 390-397, https://doi.org/10.1002/ffj.1224
. [all data]
Pitarokili, Tzakou, et al., 2003
Pitarokili, D.; Tzakou, O.; Loukis, A.; Harvala, C.,
Volatile metabolites from Salvia fruticosa as antifungal agents in soilborne pathogens,
J. Agric. Food Chem., 2003, 51, 11, 3294-3301, https://doi.org/10.1021/jf0211534
. [all data]
Priestap, van Baren, et al., 2003
Priestap, H.A.; van Baren, C.M.; Lira, P.D.L.; Coussio, J.D.; Bandoni, A.L.,
Volatile constituents of Aristolochia argentina,
Phytochemistry, 2003, 63, 2, 221-225, https://doi.org/10.1016/S0031-9422(02)00751-3
. [all data]
Velasco-Negueruela, Pérez-Alonso, et al., 2003
Velasco-Negueruela, A.; Pérez-Alonso, M.J.; Pérez de Paz, P.L.; Palá-Paúl, J.; Sanz, J.,
Analysis by gas chromatography-mass spectrometry of the essential oil from the aerial parts of Pimpinella junoniae Ceb. Ort., gathered in La Gomera, Canary Islands, Spain,
J. Chromatogr. A, 2003, 1011, 1-2, 241-244, https://doi.org/10.1016/S0021-9673(03)01082-3
. [all data]
Yassa, Akhani, et al., 2003
Yassa, N.; Akhani, H.; Aqaahmadi, M.; Salimian, M.,
Essential oils from two endemic species of Apiaceae from Iran,
Z. Naturforsch. C:, 2003, 58, 459-463. [all data]
Zoghbi, Andrade, et al., 2003
Zoghbi, M.G.B.; Andrade, E.H.A.; da Silva, M.H.; Carreira, L.M.M.; Maia, J.G.S.,
Essential oils from three Myrcia species,
Flavour Fragr. J., 2003, 18, 5, 421-424, https://doi.org/10.1002/ffj.1242
. [all data]
Flamini, Ertugrul, et al., 2002
Flamini, G.; Ertugrul, K.; Cioni, P.L.; Morelli, I.; Dural, H.; Bagci, Y.,
Volatile constituents of two endemic Centaurea species from Turkey: C. pseudoscabiosa subsp. pseudoscabiosa and C. hadimensis,
Biochem. Syst. Ecol., 2002, 30, 10, 953-959, https://doi.org/10.1016/S0305-1978(02)00043-1
. [all data]
Gancel, Ollé, et al., 2002
Gancel, A.-L.; Ollé, D.; Ollitrault, P.; Luro, F.; Brillouet, J.-M.,
Leaf and peel volatile compounds of an interspecific citrus somatic hybrid [Citrus aurantifolia (Christm.) Swing. + Citrus paradisi Macfayden],
Flavour Fragr. J., 2002, 17, 6, 416-424, https://doi.org/10.1002/ffj.1119
. [all data]
Jirovetz, Buchbauer, et al., 2002
Jirovetz, L.; Buchbauer, G.; Ngassoum, M.B.; Geissler, M.,
Aroma compound analysis of Piper nigrum and Piper guineense essential oils from Cameroon using solid-phase microextraction-gas chromatography, solid-phase microextraction-gas chromatography-mass spectrometry and olfactometry,
J. Chromatogr. A, 2002, 976, 1-2, 265-275, https://doi.org/10.1016/S0021-9673(02)00376-X
. [all data]
Khallouki, Younos, et al., 2002
Khallouki, F.; Younos, C.; Soulimani, R.; Bessière, J.M.,
Chemical composition of the essential oils of Annona cuneata L. and Annona senegalensis Pers. stem barks,
Flavour Fragr. J., 2002, 17, 5, 398-400, https://doi.org/10.1002/ffj.1115
. [all data]
Maia, Zoghbi, et al., 2002
Maia, J.G.S.; Zoghbi, M.G.B.; Andrade, E.H.A.; da Silva, M.H.L.; Luz, A.I.R.; da Silva, J.D.,
Essential oils composition of Eupatorium species growing wild in the Amazon,
Biochem. Syst. Ecol., 2002, 30, 11, 1071-1077, https://doi.org/10.1016/S0305-1978(02)00059-5
. [all data]
Palá-Paúl, Pérez-Alonso, et al., 2002
Palá-Paúl, J.; Pérez-Alonso, M.J.; Velasco-Negueruela, A.; Sanz, J.,
Analysis by gas chromatography-mass spectrometry of the volatile components of Ageratina adenophora Spreng., growing in the Canary Islands,
J. Chromatogr. A, 2002, 947, 2, 327-331, https://doi.org/10.1016/S0021-9673(02)00016-X
. [all data]
Bailac, Dellacasa, et al., 2001
Bailac, P.N.; Dellacasa, A.D.; Bernasconi, H.O.; Ponzi, M.I.; Firpo, N.H.,
Essential oil of female plants of Baccharis coridifolia De Candole,
J. Essent. Oil Res., 2001, 13, 1, 23-24, https://doi.org/10.1080/10412905.2001.9699593
. [all data]
Gallori, Bilia, et al., 2001
Gallori, S.; Bilia, A.R.; Mulinacci, N.; Bicchi, C.; Rubiolo, P.; Vincieri, F.F.,
Identification of volatile constituents of Tambourissa leptophylla,
Planta Medica, 2001, 67, 3, 290-292, https://doi.org/10.1055/s-2001-12001
. [all data]
Jacquemond-Collet, Bessière, et al., 2001
Jacquemond-Collet, I.; Bessière, J.-M.; Hannedouche, S.; Bertrand, C.; Fourasté, I.; Moulis, C.,
Identification of the alkaloids of Galipea officinalis by gas chromatography-mass spectrometry,
Phytochem. Anal., 2001, 12, 5, 312-319, https://doi.org/10.1002/pca.594
. [all data]
Palmeira, Conserva, et al., 2001
Palmeira, S.F., Jr.; Conserva, L.M.; Andrade, E.H.A.; Guilhon, G.M.S.P.,
Analysis by GC-MS of the hexane extract of the aerial parts of Aristolochia acutifolia Duchtr.,
Flavour Fragr. J., 2001, 16, 2, 85-88, https://doi.org/10.1002/1099-1026(200103/04)16:2<85::AID-FFJ948>3.0.CO;2-2
. [all data]
Santos, Moreira, et al., 2001
Santos, P.R.; Moreira, D.L.; Guimaraes, E.F.; Kaplan, M.A.C.,
Essential oil analysis of 10 piperaceae species from the Brazilian Atlantic forest,
Phytochemistry, 2001, 58, 4, 547-551, https://doi.org/10.1016/S0031-9422(01)00290-4
. [all data]
Tellez M., Estell R., et al., 2001
Tellez M.; Estell R.; Fredrickson E.; Powell J.; Wedge D.; Schrader K.; Kobaisy M.,
Extracts of Flourensia cernua (L): Volatile constituents and antifungal, antialgal, and antitermite bioactivities,
J. Chem. Ecol., 2001, 27, 11, 2263-2273, https://doi.org/10.1023/A:1012283005014
. [all data]
Bicalho, Pereira, et al., 2000
Bicalho, B.; Pereira, A.S.; Aquino Neto, F.R.; Pinto, A.C.; Rezende, C.M.,
Application of high-temperature gas chromatography-mass spectrometry to the investigation of glycosidically bound components related to cashew applie (Anacardium occidentale L. Var. nanum) volatiles,
J. Agric. Food Chem., 2000, 48, 4, 1167-1174, https://doi.org/10.1021/jf9909252
. [all data]
Feger, Brandauer, et al., 2000
Feger, W.; Brandauer, H.; Ziegler, H.,
Sesquiterpene hydrocarbons of cold-pressed lime oils,
Flavour Fragr. J., 2000, 15, 4, 281-284, https://doi.org/10.1002/1099-1026(200007/08)15:4<281::AID-FFJ916>3.0.CO;2-W
. [all data]
Fraternale, Giamperi, et al., 2000
Fraternale, D.; Giamperi, L.; Ricci, D.; Manunta, A.,
Composition of the essential oil of Peucedanum verticillare,
Biochem. Syst. Ecol., 2000, 28, 2, 143-147, https://doi.org/10.1016/S0305-1978(99)00049-6
. [all data]
Porta, Porcedda, et al., 1999
Porta, G.D.; Porcedda, S.; Marongiu, B.; Reverchon, E.,
Isolation of eucalyptus oil by supercritical fluid extraction,
Flavour Fragr. J., 1999, 14, 4, 214-218, https://doi.org/10.1002/(SICI)1099-1026(199907/08)14:4<214::AID-FFJ814>3.0.CO;2-H
. [all data]
Zoghbi, Andrade, et al., 1999
Zoghbi, M.G.B.; Andrade, E.H.A.; Maia, J.G.S.,
The essential oil of Vitex angus-castus L. growing in the Amazon region,
Flavour Fragr. J., 1999, 14, 4, 211-213, https://doi.org/10.1002/(SICI)1099-1026(199907/08)14:4<211::AID-FFJ812>3.0.CO;2-W
. [all data]
Zoghbi, Andrade, et al., 1999, 2
Zoghbi, M.G.B.; Andrade, E.H.A.; Maia, J.G.S.,
Volatile constituents from leaves and flowers of Alpinia speciosa K. Schum. and A. purpurata (Viell.) Schum.,
Flavour Fragr. J., 1999, 14, 6, 411-414, https://doi.org/10.1002/(SICI)1099-1026(199911/12)14:6<411::AID-FFJ854>3.0.CO;2-U
. [all data]
Tellez, Estell, et al., 1997
Tellez, M.R.; Estell, R.E.; Frederickson, E.L.; Havstad, K.M.,
Essntial oil of Flourensia cernua DC,
J. Essent. Oil Res., 1997, 9, 6, 619-624, https://doi.org/10.1080/10412905.1997.9700799
. [all data]
Gawdzik, Mardarowicz, et al., 1996
Gawdzik, J.; Mardarowicz, M.; Suprynowicz, Z.; Kawka, S.; Wolski, T.,
Supercritical fluid extraction of essential oils from the fruits of Archangelica off. Hoffm. and their characterization by GC/MS,
J. Hi. Res. Chromatogr., 1996, 19, 4, 237-240, https://doi.org/10.1002/jhrc.1240190416
. [all data]
Gopalakrishnan, Menon, et al., 1993
Gopalakrishnan, M.; Menon, N.; Padmakumari, K.P.; Jayalekshmy, A.; Narayanan, C.S.,
GC Analysis and Odor Profiles of Four New Indian Genotypes of Piper nigrum L.,
J. Essent. Oil Res., 1993, 5, 3, 247-253, https://doi.org/10.1080/10412905.1993.9698217
. [all data]
Kollmannsberger, Nitz, et al., 1992
Kollmannsberger, H.; Nitz, S.; Drawert, F.,
UBer die Aromastoffzusammensetzung von Hochdruckextrakten. I. Pfeffer (Piper nigrum, Var. muntok),
Z. Lebensm. Unters Forsch., 1992, 194, 6, 545-551, https://doi.org/10.1007/BF01185481
. [all data]
Binder, Turner, et al., 1990
Binder, R.G.; Turner, C.E.; Flath, R.A.,
Volatile components of purple starthistle,
J. Agric. Food Chem., 1990, 38, 4, 1053-1055, https://doi.org/10.1021/jf00094a030
. [all data]
Binder, Turner, et al., 1990, 2
Binder, R.G.; Turner, C.E.; Flath, R.A.,
Comparison of yellow starthistle volatiles from different plant parts,
J. Agric. Food Chem., 1990, 38, 3, 764-767, https://doi.org/10.1021/jf00093a038
. [all data]
Shibamoto and Jennings, 1977
Shibamoto, T.; Jennings, W.G.,
The volatile composition of the leaf oil of California Juniper (J. californica Carr.)
in Proceedings of VII International Congress of Essential Oils, October 7-11, 1977, Kyoto, Japan, 1977, 413-418. [all data]
Albano, Lima, et al., 2012
Albano, S.M.; Lima, A.S.; Miguel, M.G.; Pedro, L.G.; Barroso, J.G.; Figueiredo, A.C.,
Antioxidant, anti-5-lipoxygenase and antiacetylcholinesterase activities of essential oils and decoction water of some aromatic plants,
Rec. Nat. Prod., 2012, 6, 1, 35-48. [all data]
da Silva, de Souza, et al., 2012
da Silva, A.C.; de Souza, P.E.; Machado, J. daC.; da Silva, B.M.; Pinto, J.E.B.P.,
Effectiveness of essential oils in the treatment of Colletotrichum truncatum-infected soybean seeds,
Tropical Plant Patology, 2012, 37, 5, 305-313, https://doi.org/10.1590/S1982-56762012000500001
. [all data]
Chaverri, Diaz, et al., 2011
Chaverri, C.; Diaz, C.; Cicco, J.F.,
Chemical analysis of essential oils from Ocotea gomezii W.C. Burger and Ocotea morae Gomez-Laur. (Lauraceae) collected at Reserva biologica Alberto M. Brenes in Costa Rica and their cytotoxic activity on Tumor cell lines,
J. Braz. Chem. Soc., 2011, 22, 4, s1-s4, https://doi.org/10.1590/S0103-50532011000400018
. [all data]
Custer, 2009
Custer, Y.,
GC Volatile Components Analysis of Different Parts of Litchi chinensis (Dissertation), 2009. [all data]
Mendes, Trindade, et al., 2009
Mendes, M.D.; Trindade, H.; Figueiredo, A.C.; Pedro, L.G.; Barroso, J.G.,
Chaerophyllum azoricun Trel. grown in the Azores archipelago, Portugal: evaluation of the genetic diversity using molecular markers and comparison with volatile oils profiles,
Flavour Fragr. J., 2009, 24, 5, 259-265, https://doi.org/10.1002/ffj.1939
. [all data]
Mendes, Trindade, et al., 2009, 2
Mendes, M.D.; Trindade, H.; Figueiredo, A.C.; Barroso, J.G.; Fontinha, S.S.; Pedro, L.G.,
Volatile and molecular characterization of two Portuguese endemic species: Angelica lignescens and Melanoselinium decipiens,
Biochen. Systematics Ecol., 2009, 37, 2, 98-105, https://doi.org/10.1016/j.bse.2008.12.006
. [all data]
Kannaste, Vongvanich, et al., 2008
Kannaste, A.; Vongvanich, N.; Borg-Karlson, A.-K.,
Infestation by a Nalepella species induces emissions of alpha- and beta-farnesenes, (-)-linalool and aromatic compounds in Norway spruce clones of different susceptibility to the large pine weevil,
Anthropod-Plant Interactions, 2008, 2, 1, 31-41, https://doi.org/10.1007/s11829-008-9029-4
. [all data]
Profitt, Schatz, et al., 2008
Profitt, M.; Schatz, B.; Bessiere, J.-M.; Chen, C.; Soler, C.; Hossaert-McKey, M.,
Signalling receptivity: comparison of the emission of volatile compounds by figs of Ficus hispida before, during and after the phase of receptivity to pollinators,
Symbiosis, 2008, 45, 1-10. [all data]
Silva, Doria, et al., 2008
Silva, W.L.; Doria, G.A.A.; Maia, R.T.; Nunes, R.S.; Carvalho, G.A.; Blank, A.F.; Alves, P.B.; Marcal, R.M.; Cavalcanti, S.C.H.,
Effects of essential oils on Aedes aegypti larvae: alternatives to environmentally safe insecticides,
Bioresource Technol., 2008, 99, 8, 3251-3255, https://doi.org/10.1016/j.biortech.2007.05.064
. [all data]
Zachariah, Leela, et al., 2008
Zachariah, T.J.; Leela, N.K.; Maya, K.M.; Rema, J.; Mathew, P.A.; Vipin, T.M.; Krishnamoorthy, B.,
Chemical composition of leaf oils of Myristica beddomeii (King), Myristica fragrans (Houtt.) and Myristica malabarica (Lamk.),
J. Spices Arom. Crops, 2008, 17, 1, 10-15. [all data]
Albuquerque, Vasconcelos Silva, et al., 2007
Albuquerque, R.L.; Vasconcelos Silva, M.G.; Machado, M.I.L.; Matos, F.J.A.; Morais, S.M.; Neto, J.S.,
Chemical composition and antioxidant activity of Plectranthus grandis and P. ornatus essential oils from north-eastern Brazil,
Flavour Fragr. J., 2007, 22, 1, 24-26, https://doi.org/10.1002/ffj.1730
. [all data]
Eason and Setzer, 2007
Eason, H.M.; Setzer, W.N.,
BArk essential oil composition of Cedrela tinduzii C. DC. (Meliaceae) from Monteverde, Costa Rica,
Rec. NAt. Prod., 2007, 1, 2-3, 24-27. [all data]
Ferreira, Meireles de Sousa, et al., 2007
Ferreira, N.J.; Meireles de Sousa, I.G.; Luís, T.C.; Currais, A.J.M.; Figueiredo, C.; Cost, M.M.; Lima, A.S.B.; Santos, P.A.G.; Barroso, J.G.; Pedro, L.G.; Scheffer, J.J.C.,
Pittosporum undulatum Vent. grown in Portugal: secretory structures, seasonal variation and enantiomeric composition of its essential oil,
Flavour Fragr. J., 2007, 22, 1, 1-9, https://doi.org/10.1002/ffj.1748
. [all data]
Meekijjaroenroj, Bessière, et al., 2007
Meekijjaroenroj, A.; Bessière, J.-M.; Anstett, M.-C.,
Chemistry of floral scents in four Licuala species (Arecaceae),
Flavour Fragr. J., 2007, 22, 4, 300-310, https://doi.org/10.1002/ffj.1797
. [all data]
Proffit, 2007
Proffit, M.,
Mediation chimique et structuration des communautes d'hymenopteres parasites du mutualisme figuier / pollinisateur (These pour obtenir le grade de Docteur de l'Universite Montpellier II) (Dissertation), 2007. [all data]
Radusiene, Judzentiene, et al., 2007
Radusiene, J.; Judzentiene, A.; Peciulyte, D.; Janulis, V.,
Essential Oil Composition and Antimicrobial Assay of Acorus calamus Leaves from Different Wild Populations,
Plant Genetic Resources: Characterization and Utilization, 2007, 5, 1, 37-44, https://doi.org/10.1017/S1479262107390928
. [all data]
Santos, Santiago, et al., 2007
Santos, H.S.; Santiago, G.M.P.; de Oliveira, J.P.P.; Arriaga, A.M.C.; Marques, D.D.; Lemos, T.L.G.,
Chemical composition and larvicidal activity against Aedes aegypti of essential oils from Croton zehntneri,
Natural Product Communications, 2007, 2, 12, 1233-1236. [all data]
Setzer, Stokes, et al., 2007
Setzer, W.N.; Stokes, S.L.; Penton, A.F.; Takaku, S.; Haber, W.A.; Hansell, E.; Caffrey, C.R.; McKerrow, J.H.,
Cruzain inhibitory activity of leaf essential oils of neotropical Lauraceae and essential oil components,
Natural Product Communications, 2007, 2, 12, 1203-1210. [all data]
Takaku, Haber, et al., 2007
Takaku, S.; Haber, W.A.; Setzer, W.N.,
Leaf essential oil composition of 10 species of Ocotea (Lauraceae) from Monteverde, Costa Rica,
Biochem. Syst. Ecol., 2007, 35, 8, 525-532, https://doi.org/10.1016/j.bse.2007.02.003
. [all data]
Lorenzo, Loayza, et al., 2006
Lorenzo, D.; Loayza, I.; Dellacassa, E.,
Composition and chiral characterization of the essential oil of Buddleja tucumanensis from Bolivia,
Flavour Fragr. J., 2006, 21, 1, 95-98, https://doi.org/10.1002/ffj.1526
. [all data]
Souza, Souza, et al., 2006
Souza, M.A.A.; Souza, S.R.; Veiga, V.F., Jr.; Cortez, J.K.P.C.; Leal, R. de.S.; Dantas, T.N.C.; Maciel, M.A.M.,
Composicao quimica do oleo fixo de Croton cajucara e determinacao das suas propridades fungicidas,
Braz. J. Pharmacognosy, 2006, 16, 599-610. [all data]
Tognolini, Barocelli, et al., 2006
Tognolini, M.; Barocelli, E.; Ballabeni, V.; Bruni, R.; Bianchi, A.; Chiavarini, M.; Impicciatore, M.,
Comparative screening of plant essential oils: Phenylpropanoid moiety as basic core for antiplatelet activity,
Life Sciences, 2006, 78, 13, 1419-1432, https://doi.org/10.1016/j.lfs.2005.07.020
. [all data]
Xie, Sun, et al., 2006
Xie, J.; Sun, B.; Yu, M.,
Constituents of top fragrance from fresh flowers of Robinia Pseudoacacia L. occurring in China,
Flavour Fragr. J., 2006, 21, 5, 798-800, https://doi.org/10.1002/ffj.1720
. [all data]
Belhattab, Larous, et al., 2005
Belhattab, R.; Larous, L.; Figueiredo, A.C.; Santos, P.A.G.; Barroso, J.G.; Pedro, L.G.,
Origanum glandulosum Desf. grown wild in Algeria: essential oil composition and glycosidic bound volatiles,
Flavour Fragr. J., 2005, 20, 2, 209-212, https://doi.org/10.1002/ffj.1387
. [all data]
Figueiredo, Sim-Sim, et al., 2005
Figueiredo, A.C.; Sim-Sim, M.; Costa, M.M.; Barroso, J.G.; Pedro, L.G.; Esquível, M.G.; Gutierres, F.; Lobo, C.; Fontinha, S.,
Comparison of the essential oil composition of four Plagiochila species: P. bifaria, P. maderensis, P. retrorsa and P. stricta,
Flavour Fragr. J., 2005, 20, 6, 703-709, https://doi.org/10.1002/ffj.1627
. [all data]
Novak, Draxler, et al., 2005
Novak, J.; Draxler, L.; Göhler, I.; Franz, C.M.,
Essential oil composition of Vitex agnus-castus - comparison of accessions and different plant organs,
Flavour Fragr. J., 2005, 20, 2, 186-192, https://doi.org/10.1002/ffj.1404
. [all data]
Singh, Maurya, et al., 2005
Singh, G.; Maurya, S.; Catalan, C.; de Lampasona, M.P.,
Studies on essential oils, Part 42: chemical, antifungal, antioxidant and sprout suppressant studies on ginger essential oil and its oleoresin,
Flavour Fragr. J., 2005, 20, 1, 1-6, https://doi.org/10.1002/ffj.1373
. [all data]
Cavalcanti, de Morais, et al., 2004
Cavalcanti, E.S.B.; de Morais, S.M.; Lima, M.A.A.; Santana, E.W.P.,
Larvicidal activity of essential oils from Brazilian plants against Aedes aegypti L.,
Mem. Inst. Oswaldo Cruz., 2004, 99, 5, 541-544, https://doi.org/10.1590/S0074-02762004000500015
. [all data]
Sahin, Gulluce, et al., 2004
Sahin, F.; Gulluce, M.; Daferera, D.; Sokmen, A.; Sokmen, M.; Polissiou, M.; Agar, G.; Ozer, H.,
Biological activities of the essential oils and methanol extract of Origanum vulgare ssp. vulgare in the Eastern Anatolia region of Turkey,
Food Control, 2004, 15, 7, 549-557, https://doi.org/10.1016/j.foodcont.2003.08.009
. [all data]
Silva, Matos, et al., 2004
Silva, M.G. deV.; Matos, F.J. de.A.; Lopes, P.R.O.; Silva, F.O.; Holanda, M.T.,
Composition of Essential Oils from Three Ocimum Species Obtained by Steam and Microwave Distillation and Supercritical CO2 Extraction,
ARKIVOS, 2004, 6, 6, 66-71, https://doi.org/10.3998/ark.5550190.0005.609
. [all data]
Silva, Matos, et al., 2003
Silva, M.G.V.; Matos, F.J.A.; Machado, M.I.L.; Craveiro, A.A.,
Essential oils of Ociumum basilicum L., O. basilicum. var. minimum L. and O. basilicum. var. purpurascens Benth. grown in north-eastern Brazil,
Flavour Fragr. J., 2003, 18, 1, 13-14, https://doi.org/10.1002/ffj.1134
. [all data]
Viana, Andrade-Neto, et al., 2002
Viana, F.A.; Andrade-Neto, M.; Pouliquen, Y.B.M.; Lucien, V.G.,
Chemical composition of the essential oil from roots of Philodendron acutatum Schott.,
J. Essent. Oil Res., 2002, 14, 3, 172-174, https://doi.org/10.1080/10412905.2002.9699814
. [all data]
Kéita, Vincent, et al., 2000
Kéita, S.M.; Vincent, C.; Schmit, J.-P.; Bélanger, A.,
Essential oil composition of Ocimum basilicum L., O. gratissimum L. and O. suave L. in the Republic of Guinea,
Flavour Fragr. J., 2000, 15, 5, 339-341, https://doi.org/10.1002/1099-1026(200009/10)15:5<339::AID-FFJ922>3.0.CO;2-H
. [all data]
Pedro, da Silva, et al., 1999
Pedro, L.G.; da Silva, J.A.; Barroso, J.G.; Figueiredo, A.C.; Deans, S.G.; Looman, A.; Scheffer, J.J.C.,
Composition of the essential oil fo Chaerophyllum azoricum Trel., an endemic species of the Azores archipelago,
Flavour Fragr. J., 1999, 14, 5, 287-289, https://doi.org/10.1002/(SICI)1099-1026(199909/10)14:5<287::AID-FFJ827>3.0.CO;2-O
. [all data]
Weyerstahl, Marschall, et al., 1999
Weyerstahl, P.; Marschall, H.; Eckhardt. A.; Christiansen, C.,
Constituents of commercial Brazilian Iantana oil,
Flavour Fragr. J., 1999, 14, 1, 15-28, https://doi.org/10.1002/(SICI)1099-1026(199901/02)14:1<15::AID-FFJ777>3.0.CO;2-M
. [all data]
Weyerstahl, Marschall, et al., 1999, 2
Weyerstahl, P.; Marschall, H.; Son, P.T.; Giang, P.M.,
Constituents of the flower essential oil of Aglaia odorata Lour. from Vietnam,
Flavour Fragr. J., 1999, 14, 4, 219-224, https://doi.org/10.1002/(SICI)1099-1026(199907/08)14:4<219::AID-FFJ815>3.0.CO;2-#
. [all data]
Baratta, Dorman, et al., 1998
Baratta, M.T.; Dorman, H.J.; Deans, S.G.; Figueiredo, A.C.; Barroso, J.G.; Ruberto, G.,
Antimicrobial and antioxidant properties of some commercial essential oils,
Flavour Fragr. J., 1998, 13, 4, 235-244, https://doi.org/10.1002/(SICI)1099-1026(1998070)13:4<235::AID-FFJ733>3.0.CO;2-T
. [all data]
Sanda, Koba, et al., 1998
Sanda, K.; Koba, K.; Nambo, P.; Gaset, A.,
Chemical investigation of Ocimum species growing in Togo,
Flavour Fragr. J., 1998, 13, 4, 226-232, https://doi.org/10.1002/(SICI)1099-1026(1998070)13:4<226::AID-FFJ717>3.0.CO;2-H
. [all data]
Weyerstahl, Marschall, et al., 1998
Weyerstahl, P.; Marschall, H.; Wolf, D.,
Constituents of commercial Brazilian cabore oil,
Flavour Fragr. J., 1998, 13, 2, 85-86, https://doi.org/10.1002/(SICI)1099-1026(199803/04)13:2<85::AID-FFJ697>3.0.CO;2-9
. [all data]
Yusuf, Begum, et al., 1998
Yusuf, M.; Begum, J.; Mondello, L.; Stagno d'Alcontres, I.S.,
Studies on the essential oil bearing plants of Bangladesh. Part VI. Composition of the oil of Ocimum gratissimum L.,
Flavour Fragr. J., 1998, 13, 3, 163-166, https://doi.org/10.1002/(SICI)1099-1026(199805/06)13:3<163::AID-FFJ714>3.0.CO;2-1
. [all data]
Figueiredo, Barroso, et al., 1997
Figueiredo, A.C.; Barroso, J.G.; Pedro, L.G.; Fontinha, S.S.; Looman, A.; Scheffer, J.J.C.,
Composition of the essential oil of Monizia edulis Lowe, an endemic species of the Madeira Archipelago,
Flavour Fragr. J., 1997, 12, 1, 29-31, https://doi.org/10.1002/(SICI)1099-1026(199701)12:1<29::AID-FFJ607>3.0.CO;2-K
. [all data]
Barroso, Figueiredo, et al., 1996
Barroso, J.G.; Figueiredo, A.C.; Pedro, L.G.; Antunes, T.; Sevinate-Pinto, I.; Fontinha, S.S.; Scheffer, J.J.C.,
Composition of the essential oil of teucrium heterophyllum L'Her. Grown on Madiera,
Flavour Fragr. J., 1996, 11, 2, 129-132, https://doi.org/10.1002/(SICI)1099-1026(199603)11:2<129::AID-FFJ550>3.0.CO;2-Z
. [all data]
Beck, Higbee, et al., 2008
Beck, J.J.; Higbee, B.S.; Marrill, G.B.; Roitman, J.N.,
Comparison of volatile emissions from undamaged and mechanically damaged almonds,
J, Sci. Food Argic., 2008, 88, 8, 1363-1368, https://doi.org/10.1002/jsfa.3224
. [all data]
Lesueur, Ban, et al., 2006
Lesueur, D.; Ban, N.K.; Bighelli, A.; Muselli, A.; Casanova, J.,
Analysis of the root oil of Fokienia hodginsii (Dunn) Henry et Thomas (Cupressaceae) by GC, GC-MS and 13C-NMR,
Flavour Fragr. J., 2006, 21, 1, 171-174, https://doi.org/10.1002/ffj.1557
. [all data]
Velasco-Negueruela, Pérez-Alonso, et al., 2003, 2
Velasco-Negueruela, A.; Pérez-Alonso, M.J.; Pérez de Paz, P.L.; Palá-Paúl, J.; Sanz, J.,
Analysis by gas chromatography-mass spectrometry of the essential oils from the aerial parts of Rutheopsis herbanica (Bolle) Hans. Kunk., gathered in Fuerteventura (Canary Islands),
J. Chromatogr. A, 2003, 984, 1, 159-162, https://doi.org/10.1016/S0021-9673(02)01742-9
. [all data]
Umano, Hagi, et al., 2000
Umano, K.; Hagi, Y.; Nakahara, K.; Shoji, A.; Shibamoto, T.,
Volatile chemicals identified in extracts from leaves of Japanese mugwort (Artemisia princeps Pamp.),
J. Agric. Food Chem., 2000, 48, 8, 3463-3469, https://doi.org/10.1021/jf0001738
. [all data]
Onocha, Ekundayo, et al., 1999
Onocha, P.A.; Ekundayo, O.; Oyelola, O.; Laakso, I.,
Essential oils of Dacryodes edulis (G. Don) H. J. Lam (African pear),
Flavour Fragr. J., 1999, 14, 2, 135-139, https://doi.org/10.1002/(SICI)1099-1026(199903/04)14:2<135::AID-FFJ788>3.0.CO;2-L
. [all data]
Werkhoff, Güntert, et al., 1998
Werkhoff, P.; Güntert, M.; Krammer, G.; Sommer, H.; Kaulen, J.,
Vacuum headspace method in aroma research: flavor chemistry of yellow passion fruits,
J. Agric. Food Chem., 1998, 46, 3, 1076-1093, https://doi.org/10.1021/jf970655s
. [all data]
Gaydou, Faure, et al., 1989
Gaydou, E.M.; Faure, R.; Bianchini, J.-P.; Lamaty, G.; Rakotonirainy, O.; Randriamiharisoa, R.,
Sesquiterpene composition of basil oil. Assignment of the 1H and 13C NMR spectra of β-elemene with two-dimensional NMR,
J. Agric. Food Chem., 1989, 37, 4, 1032-1037, https://doi.org/10.1021/jf00088a048
. [all data]
Vichi, Guadayol, et al., 2006
Vichi, S.; Guadayol, J.M.; Caixach, J.; López-Tamames, E.; Buxaderas, S.,
Monoterpene and sesquiterpene hydrocarbons of virgin olive oil by headspace solid-phase microextraction coupled to gas chromatography/mass spectrometry,
J. Chromatogr. A, 2006, 1125, 1, 117-123, https://doi.org/10.1016/j.chroma.2006.05.029
. [all data]
Sezik E., Kocakulak E., et al., 2005
Sezik E.; Kocakulak E.; Baser K.H.C.; Ozek T.,
Composition of the essential oils of Juniperus oxycedrus subsp macrocarpa from Turkey,
Chem. Nat. Compd. (Engl. Transl.), 2005, 41, 3, 352-354, https://doi.org/10.1007/s10600-005-0149-0
. [all data]
Viljoen, Subramoney, et al., 2005
Viljoen, A.M.; Subramoney, S.; van Vuuren, S.F.; Baser, K.H.C.; Demirci, B.,
The composition, geographical variation and antimicrobial activity of Lippia javanica (Verbenaceae) leaf essential oils,
J. Ethnopharmacol., 2005, 96, 1-2, 271-277, https://doi.org/10.1016/j.jep.2004.09.017
. [all data]
Tucker, Maciarello, et al., 2001
Tucker, A.O.; Maciarello, M.J.; Alkire, B.H.,
Essential oil of Aeollanthus suaveolens Mart. ex Spreng. (Lamiaceae),
J. Essent. Oil Res., 2001, 13, 3, 198-199, https://doi.org/10.1080/10412905.2001.9699662
. [all data]