HAu
- Formula: AuH
- Molecular weight: 197.97451
- CAS Registry Number: 13464-75-0

Gas phase ion energetics data

Data compiled by: John E. Bartmess
De-protonation reactions
Au- + = HAu
Quantity | Value | Units | Method | Reference | Comment |
---|---|---|---|---|---|
ΔrH° | 1378. ± 7.9 | kJ/mol | D-EA | Hotop and Lineberger, 1973 | gas phase |
Quantity | Value | Units | Method | Reference | Comment |
ΔrG° | 1356. ± 8.4 | kJ/mol | H-TS | Hotop and Lineberger, 1973 | gas phase |

Reaction thermochemistry data

Data compiled by: John E. Bartmess
Individual Reactions
Au- + = HAu
Quantity | Value | Units | Method | Reference | Comment |
---|---|---|---|---|---|
ΔrH° | 329.3 ± 1.9 | kcal/mol | D-EA | Hotop and Lineberger, 1973 | gas phase |
Quantity | Value | Units | Method | Reference | Comment |
ΔrG° | 324.1 ± 2.0 | kcal/mol | H-TS | Hotop and Lineberger, 1973 | gas phase |

Constants of diatomic molecules

Data compiled by: Klaus P. Huber and Gerhard H. Herzberg
Data collected through November, 1974
Symbol | Meaning |
---|---|
State | electronic state and / or symmetry symbol |
Te | minimum electronic energy (cm-1) |
ωe | vibrational constant – first term (cm-1) |
ωexe | vibrational constant – second term (cm-1) |
ωeye | vibrational constant – third term (cm-1) |
Be | rotational constant in equilibrium position (cm-1) |
αe | rotational constant – first term (cm-1) |
γe | rotation-vibration interaction constant (cm-1) |
De | centrifugal distortion constant (cm-1) |
βe | rotational constant – first term, centrifugal force (cm-1) |
re | internuclear distance (Å) |
Trans. | observed transition(s) corresponding to electronic state |
ν00 | position of 0-0 band (units noted in table) |
State | Te | ωe | ωexe | ωeye | Be | αe | γe | De | βe | re | Trans. | ν00 |
---|---|---|---|---|---|---|---|---|---|---|---|---|
C 1Σ+ | (43350) | (1550) 1 | [(6.66)] 1 | [1.589] 1 | C → X R | (42986) 1 | ||||||
↳missing citation | ||||||||||||
c 0- | 42922 | [1229] Z | (42) | 5.96 | 0.27 | 0.00053 | 1.680 | c → X 2 R | 42426 Z | |||
↳Ringstrom, 1963 | ||||||||||||
b 1 | 42883 | [1075.9] Z | (58) | 5.627 3 | 0.320 | 0.00035 | 1.7285 | b → X 3 R | 42323.0 Z | |||
↳Ringstrom, 1963 | ||||||||||||
a 2 | (42720) | (1020) | (45) | [5.523] 4 | 4 | 0.00039 | [1.7447] | a → X R | 42077.1 Z | |||
↳Ringstrom, 1963 | ||||||||||||
State | Te | ωe | ωexe | ωeye | Be | αe | γe | De | βe | re | Trans. | ν00 |
B 0+ | (38545) 5 | [1544.5] Z | (74) 6 | 5.849 7 8 | 0.187 6 | [3.0E-4] 9 | 1.6954 | B ↔ X R | 38231.8 Z | |||
↳Heimer, 1936; missing citation; Loginov, 1964 | ||||||||||||
A 0+ | 27665.7 5 | 1669.55 Z | 55.06 | -3.93 | 6.0069 | 0.249 | -0.027 | 0.000324 | 0.000028 | 1.67297 | A ↔ X R | 27344.5 Z |
↳Farkas, 1929; Heimer, 1936; Imanishi, 1937; missing citation; Loginov, 1964 | ||||||||||||
X 1Σ+ | 0 | 2305.01 Z | 43.12 | -0.44 | 7.2401 | 0.2136 | 0.000279 | -0.00000084 | 1.52385 |

References

Hotop and Lineberger, 1973
Hotop, H.; Lineberger, W.C.,
Dye-laser Photodetachment Studies of Au-, Pt-, PtN-, and Ag-,
J. Chem. Phys., 1973, 58, 6, 2379, https://doi.org/10.1063/1.1679515
. [all data]