2-benzyl-1-phenylheptadecane

Phase change data

Data compiled by: Thermodynamics Research Center, NIST Boulder Laboratories, Chris Muzny director

Quantity Value Units Method Reference Comment
Tfus304.4KN/AWibaut, Overhoff, et al., 1943Uncertainty assigned by TRC = 2. K; melting point in capillary tube
Tfus303.8KN/AWibaut, Overhoff, et al., 1943Uncertainty assigned by TRC = 2. K; disappearance of last crystal in liq.
Tfus303.0KN/AWibaut, Overhoff, et al., 1943Uncertainty assigned by TRC = 2. K; solidification point

In addition to the Thermodynamics Research Center (TRC) data available from this site, much more physical and chemical property data is available from the following TRC products:

References

Wibaut, Overhoff, et al., 1943
Wibaut, J.P.; Overhoff, J.; Jonker, E.W., On the Preparation of Some Hydrocarbons of the Mixed Aliphatic-Aromatic and Aliphatic-Alicyclic Type Containing 22 to 30 C-atoms, Recl. Trav. Chim. Pays-Bas, 1943, 62, 31. [all data]