Diethyltartrate dinitrate
- Formula: C8H12N2O10
- Molecular weight: 296.1883
- CAS Registry Number: 13454-52-9

Condensed phase thermochemistry data

Data compiled by: Hussein Y. Afeefy, Joel F. Liebman, and Stephen E. Stein
Quantity | Value | Units | Method | Reference | Comment |
---|---|---|---|---|---|
ΔcH°solid | -3930.2 | kJ/mol | Ccb | Castronia, 1949 |

References

Castronia, 1949
Castronia, T.C.,
Long range basic research leading to the development of ideal propellants,
Picatinny Arsenal Techn. Rep. No. 1755, 1949, 1. [all data]