gallium tribromide

Phase change data

Data compiled by: William E. Acree, Jr., James S. Chickos

Quantity Value Units Method Reference Comment
Δsub92.5 ± 2.0kJ/molTEBrunetti, Piacente, et al., 2009Based on data from 300. - 357. K.

References

Brunetti, Piacente, et al., 2009
Brunetti, Bruno; Piacente, Vincenzo; Scardala, Paolo, A Study on the Sublimation of Gallium Tribromide, J. Chem. Eng. Data, 2009, 54, 8, 2273-2276, https://doi.org/10.1021/je900182h . [all data]