molybdenum tribromide

Gas phase thermochemistry data

Quantity Value Units Method Reference Comment
Δfgas-8.37kJ/molReviewChase, 1998Data last reviewed in September, 1978
Quantity Value Units Method Reference Comment
gas,1 bar374.98J/mol*KReviewChase, 1998Data last reviewed in September, 1978

Gas Phase Heat Capacity (Shomate Equation)

Cp° = A + B*t + C*t2 + D*t3 + E/t2
H° − H°298.15= A*t + B*t2/2 + C*t3/3 + D*t4/4 − E/t + F − H
S° = A*ln(t) + B*t + C*t2/2 + D*t3/3 − E/(2*t2) + G
    Cp = heat capacity (J/mol*K)
    H° = standard enthalpy (kJ/mol)
    S° = standard entropy (J/mol*K)
    t = temperature (K) / 1000.

View plot Requires a JavaScript / HTML 5 canvas capable browser.

View table.

Temperature (K) 298. - 6000.
A 80.83948
B 3.798182
C -0.185714
D -0.029409
E -0.146255
F -33.13297
G 470.8632
H -8.368001
ReferenceChase, 1998
Comment Data last reviewed in September, 1978

Condensed phase thermochemistry data

Quantity Value Units Method Reference Comment
Δfsolid-67.801kcal/molReviewChase, 1998Data last reviewed in September, 1978
Quantity Value Units Method Reference Comment
solid41.699cal/mol*KReviewChase, 1998Data last reviewed in September, 1978

Solid Phase Heat Capacity (Shomate Equation)

Cp° = A + B*t + C*t2 + D*t3 + E/t2
H° − H°298.15= A*t + B*t2/2 + C*t3/3 + D*t4/4 − E/t + F − H
S° = A*ln(t) + B*t + C*t2/2 + D*t3/3 − E/(2*t2) + G
    Cp = heat capacity (cal/mol*K)
    H° = standard enthalpy (kcal/mol)
    S° = standard entropy (cal/mol*K)
    t = temperature (K) / 1000.

View plot Requires a JavaScript / HTML 5 canvas capable browser.

View table.

Temperature (K) 298. - 1500.
A 24.13760
B 3.506090
C -0.005372
D 0.001577
E 0.000112
F -75.15210
G 69.86589
H -67.80000
ReferenceChase, 1998
Comment Data last reviewed in September, 1978

References

Chase, 1998
Chase, M.W., Jr., NIST-JANAF Themochemical Tables, Fourth Edition, J. Phys. Chem. Ref. Data, Monograph 9, 1998, 1-1951. [all data]