trans-4,5-Epoxy-(E)-2-decenal

Van Den Dool and Kratz RI, non-polar column, temperature ramp

Data compiled by: NIST Mass Spectrometry Data Center, William E. Wallace, director

Column type CapillaryCapillaryCapillaryCapillaryCapillary
Active phase HP-5MSZB-5DB-5SE-54DB-5
Column length (m) 30.30.30.50.30.
Carrier gas HeHe He
Substrate
Column diameter (mm) 0.250.320.320.320.32
Phase thickness (μm) 0.50.50.5 0.25
Tstart (C) 35.40.40.40.40.
Tend (C) 225.265.265.240.240.
Heat rate (K/min) 4.7.7.8.6.
Initial hold (min) 5.  2.2.
Final hold (min) 30.5.5.5.10.
I 1389.1385.1390.1385.1382.
ReferenceJarunrattanasri, Theerakulkait, et al., 2007Ruiz Perez-Cacho, Mahattanatawee, et al., 2007Ruiz Perez-Cacho, Mahattanatawee, et al., 2007Schlutt B., Moran N., et al., 2007Steinhaus and Schieberle, 2007
Comment MSDC-RI MSDC-RI MSDC-RI MSDC-RI MSDC-RI
Column type CapillaryCapillaryCapillaryCapillaryCapillary
Active phase DB-5ZB-5ZB-5DB-5MSDB-5
Column length (m) 30.30.30.30.60.
Carrier gas HeHeHeliumHeHe
Substrate
Column diameter (mm) 0.320.320.320.250.25
Phase thickness (μm) 0.250.50.500.250.25
Tstart (C) 40.40.40.35.40.
Tend (C) 230.265.265.200.275.
Heat rate (K/min) 6.7.7.10.7.
Initial hold (min) 1.  5.
Final hold (min)  5.5.30.
I 1378.1375.1383.1379.1380.
ReferenceZeller and Rychlik, 2006Mahattanatawee, Rouseff, et al., 2005Bell, 2004Karagül-Yüceer, Vlahovich, et al., 2003Valim, Rouseff, et al., 2003
Comment MSDC-RI MSDC-RI MSDC-RI MSDC-RI MSDC-RI
Column type Capillary
Active phase DB-5
Column length (m) 30.
Carrier gas
Substrate
Column diameter (mm) 0.32
Phase thickness (μm) 0.25
Tstart (C) 35.
Tend (C) 200.
Heat rate (K/min) 10.
Initial hold (min) 5.
Final hold (min) 30.
I 1392.
ReferenceKaragül-Yüceer, Drake, et al., 2001
Comment MSDC-RI

Van Den Dool and Kratz RI, non-polar column, custom temperature program

Data compiled by: NIST Mass Spectrometry Data Center, William E. Wallace, director

Column type CapillaryCapillaryCapillaryCapillaryCapillary
Active phase SE-54SE-54DB-5DB-5DB-5
Column length (m) 30.30.30.30.25.
Carrier gas   HeHeHe
Substrate
Column diameter (mm) 0.320.320.320.320.32
Phase thickness (μm) 0.250.250.250.250.25
Program 40C(2min) => 6C/min => 150C => 20C/min => 230C40C(2min) => 6C/min => 150C => 20C/min => 230C20C => 70C/min => 50C => 4C/min => 180C => 10C/min => 240C(10min)40C(1min) => 40C/min => 50C(2min) => 6C/min => 240C35C (2min) => 40C/min => 50C (2min) => 4C/min => 240C (10min)
I 1374.1379.1379.1380.1381.
ReferenceSchuh and Schieberle, 2006Schuh and Schieberle, 2006Lin and Blank, 2003Jezussek, Juliano, et al., 2002Kirchhoff and Schieberle, 2002
Comment MSDC-RI MSDC-RI MSDC-RI MSDC-RI MSDC-RI
Column type CapillaryCapillaryCapillaryCapillaryCapillary
Active phase DB-5DB-5DB-5DB-5DB-5
Column length (m) 25.30.30.30.25.
Carrier gas HeHeHeHeHe
Substrate
Column diameter (mm) 0.320.250.320.320.32
Phase thickness (μm) 0.250.250.250.250.25
Program 35C (2min) => 40C/min => 50C (2min) => 4C/min => 240C (10min)35 C (2 min) 40 C/min -> 50 C (2 min) 4 C/min -> 230 C20C => 70C/min => 50C => 4C/min => 180C => 10C/min => 240C(10min)35C(2min) => 40C/min => 50C(2min) => 6C/min => 180C => 10C/min=230C(10min)35C(2min) => 40C/min => 50C(2min) => 4C/min => 240C(10min)
I 1381.1378.1381.1381.1381.
ReferenceKirchhoff and Schieberle, 2002Zehentbauer and Reineccius, 2002Blank, Lin, et al., 2001Buettner and Schieberle, 2001Kirchhoff and Schieberle, 2001
Comment MSDC-RI MSDC-RI MSDC-RI MSDC-RI MSDC-RI
Column type CapillaryCapillaryCapillaryCapillaryCapillary
Active phase DB-5DB-5CP Sil 8 CBSE-54SE-54
Column length (m) 30.30.30.30.30.
Carrier gas   HeHeHe
Substrate
Column diameter (mm) 0.320.320.320.250.32
Phase thickness (μm) 0.250.25 0.250.25
Program 40C(2min) => 40C/min => 50C (1min) => 6C/min => 180C => 10C/min => 240C (5min)40C(2min) => 40C/min => 50C (1min) => 6C/min => 180C => 10C/min => 240C (5min)35C (2min) => 40C/min => 50C (2min) => 6C/min => 180C => 10C/min => 240C35C(2min) => 40C/min => 60C => 6C/min => 180C 20C/min => 240C(10min)35C (2min) => 40C/min => 50C (2min) => 6C/min => 180C => 10C/min => 230C (10min)
I 1380.1380.1375.1382.1380.
ReferenceMunk, Munch, et al., 2000Munk, Munch, et al., 2000Steinhaus and Schieberle, 2000Zimmermann and Schieberle, 2000Buettner and Schieberle, 1999
Comment MSDC-RI MSDC-RI MSDC-RI MSDC-RI MSDC-RI
Column type CapillaryCapillaryCapillaryCapillaryCapillary
Active phase SE-54DB-5SE-54SE-54SE-54
Column length (m) 30.30.60.25.30.
Carrier gas HeHeHeHeHe
Substrate
Column diameter (mm) 0.320.320.320.320.32
Phase thickness (μm) 0.250.250.250.50.25
Program 35C (2min) => 40C/min => 50C => 4C/min => 230C (10min)20C => 70C/min => 50C => 4C/min => 180C => 10C/min => 240C(10min)40C(2min) => 5C/min => 70C(2min) => 6C/min => 250C(10min)35C (2min) => 4C/min => 150C => 10C/min => 240C35C(2min) => 40C/min => 50C(2min) => 6C/min => 180C => 10C/min => 230C(10 min)
I 1362.1378.1384.1380.1380.
ReferenceDerail, Hofmann, et al., 1999Lin J.M., Fay L.B., et al., 1999Mutti and Grosch, 1999Fickert and Schieberle, 1998Hinterholzer, Lemos, et al., 1998
Comment MSDC-RI MSDC-RI MSDC-RI MSDC-RI MSDC-RI
Column type CapillaryCapillaryCapillaryCapillary
Active phase SE-54DB-5MSDB-5SE-54
Column length (m) 30.30.30.
Carrier gas He He
Substrate
Column diameter (mm) 0.320.250.25
Phase thickness (μm) 0.250.51.
Program 35C(2min) => 40C/min => 50C(2min) => 6C/min => 180C => 10C/min => 230C(10min)40C(2min) => 6C/min => 180C => 10C/min => 250C35C (2min) => 40C/min => 50C (1min) => 6C/min => 250C (10min)35C (2min) => 40C/min => 50C (1min) => 6C/min => 250C (10min)
I 1380.1383.1384.1382.
ReferenceHinterholzer and Schieberie, 1998Milo and Reineccius, 1997Triqui and Reineccius, 1995Triqui and Reineccius, 1995
Comment MSDC-RI MSDC-RI MSDC-RI MSDC-RI

Van Den Dool and Kratz RI, polar column, custom temperature program

Data compiled by: NIST Mass Spectrometry Data Center, William E. Wallace, director

Column type CapillaryCapillaryCapillaryCapillaryCapillary
Active phase FFAPFFAPDB-WaxFFAPFFAP
Column length (m) 30.30. 30.30.
Carrier gas    HeHe
Substrate
Column diameter (mm) 0.320.32 0.250.32
Phase thickness (μm) 0.250.25 0.250.25
Program 40C(2min) => 6C/min => 150C => 20C/min => 230C40C(2min) => 6C/min => 150C => 20C/min => 230Cnot specified40C(1min) => 40C/min => 50C(2min) => 6C/min => 240C35C (2min) => 60C/min => 50C (2min) => 6C/min => 240C (10min)
I 1986.2006.2006.2000.2006.
ReferenceSchuh and Schieberle, 2006Schuh and Schieberle, 2006Elston, Lin, et al., 2005Jezussek, Juliano, et al., 2002Kirchhoff and Schieberle, 2002
Comment MSDC-RI MSDC-RI MSDC-RI MSDC-RI MSDC-RI
Column type CapillaryCapillaryCapillaryCapillaryCapillary
Active phase FFAPFFAPFFAPDB-FFAPDB-FFAP
Column length (m) 30.30.30.30.30.
Carrier gas HeHeHe
Substrate
Column diameter (mm) 0.320.320.320.320.32
Phase thickness (μm) 0.250.250.250.250.25
Program 35C (2min) => 60C/min => 50C (2min) => 6C/min => 240C (10min)35C(2min) => 40C/min => 60C(2min) => 6C/min => 180C => 10C/min=230C(10min)40C(2min) => 40C/min => 60C(2min) => 6C/min => 240C(10min)40C(2min) => 40C/min => 60C (2min) => 6C/min => 180C => 10C/min => 240C(5min)40C(2min) => 40C/min => 60C (2min) => 6C/min => 180C => 10C/min => 240C (5min)
I 2006.2006.2006.2018.1979.
ReferenceKirchhoff and Schieberle, 2002Buettner and Schieberle, 2001Kirchhoff and Schieberle, 2001Munk, Johansen, et al., 2001Munk, Munch, et al., 2000
Comment MSDC-RI MSDC-RI MSDC-RI MSDC-RI MSDC-RI
Column type CapillaryCapillaryCapillaryCapillaryCapillary
Active phase DB-FFAPFFAPFFAPFFAPFFAP
Column length (m) 30.25.30.30.30.
Carrier gas  HeHeHeHe
Substrate
Column diameter (mm) 0.320.320.250.320.32
Phase thickness (μm) 0.25 0.250.250.25
Program 40C(2min) => 40C/min => 60C (2min) => 6C/min => 180C => 10C/min => 240C (5min)35C (2min) => 40C/min => 60C (2min) => 6C/min => 180C => 10C/min => 240C35C(2min) => 40C/min => 60C => 6C/min => 180C 20C/min => 240C(10min)35C (2min) => 40C/min => 60C (2min) => 6C/min => 180C => 10C/min => 230C (10min)35C (2min) => 40C/min => 60C => 4C/min => 230C (10min)
I 1978.2007.2025.2000.1995.
ReferenceMunk, Munch, et al., 2000Steinhaus and Schieberle, 2000Zimmermann and Schieberle, 2000Buettner and Schieberle, 1999Derail, Hofmann, et al., 1999
Comment MSDC-RI MSDC-RI MSDC-RI MSDC-RI MSDC-RI
Column type CapillaryCapillaryCapillaryCapillaryCapillary
Active phase FFAPDB-WaxFFAPDB-FFAPFFAP
Column length (m) 30.30.30.30.25.
Carrier gas HeHeHeHeHe
Substrate
Column diameter (mm) 0.320.320.320.320.32
Phase thickness (μm) 0.250.250.250.250.5
Program 35C (2min) => 40C/min => 60C => 4C/min => 230C (10min)20C(1min) => 70C/min => 60C => 6C/min => 180C => 10C/min => 240C(15min)20C(2min) => 40C/min => 50C => 4C/min => 150C => 10C/min => 240C(15min)40C(2min) => 40C/min => 60C(2min) => 6C/min => 230C(10min)35C (2min) => 40C/min => 60C => 6C/min => 230C (10min)
I 1995.1993.2010.2011.2011.
ReferenceDerail, Hofmann, et al., 1999Lin J.M., Fay L.B., et al., 1999Lin J.M., Fay L.B., et al., 1999Mutti and Grosch, 1999Fickert and Schieberle, 1998
Comment MSDC-RI MSDC-RI MSDC-RI MSDC-RI MSDC-RI
Column type Capillary
Active phase FFAP
Column length (m) 30.
Carrier gas He
Substrate
Column diameter (mm) 0.32
Phase thickness (μm) 0.25
Program 35C(2min) => 40C/min => 60C(2min) => 6C/min => 180C => 10C/min => 230C(10 min)
I 2000.
ReferenceHinterholzer, Lemos, et al., 1998
Comment MSDC-RI

References

Jarunrattanasri, Theerakulkait, et al., 2007
Jarunrattanasri, A.; Theerakulkait, C.; Cadwallader, K.R., Aroma Components of Acid-Hydrolyzed Vegetable Protein Made by Partial Hydrolysis of Rice Bran Protein, J. Agric. Food Chem., 2007, 55, 8, 3044-3050, https://doi.org/10.1021/jf0631474 . [all data]

Ruiz Perez-Cacho, Mahattanatawee, et al., 2007
Ruiz Perez-Cacho, P.; Mahattanatawee, K.; Smoot, J.M.; Rouseff, R., Identification of Sulfur Volatiles in Canned Orange Juices Lacking Orange Flavor, J. Agric. Food Chem., 2007, 55, 14, 5761-5767, https://doi.org/10.1021/jf0703856 . [all data]

Schlutt B., Moran N., et al., 2007
Schlutt B.; Moran N.; Schieberle P.; Hofmann T., Sensory-directed identification of creaminess-enhancing volatiles and semivolatiles in full-fat cream, J. Agric. Food Chem., 2007, 55, 23, 9634-9645, https://doi.org/10.1021/jf0721545 . [all data]

Steinhaus and Schieberle, 2007
Steinhaus, P.; Schieberle, P., Characterization of the key aroma compounds in soy sauce using approaches of molecular sensory science, J. Agric. Food Chem., 2007, 55, 15, 6262-6269, https://doi.org/10.1021/jf0709092 . [all data]

Zeller and Rychlik, 2006
Zeller, A.; Rychlik, M., Character impact odorants of fennel fruits and fennel tea, J. Agric. Food Chem., 2006, 54, 10, 3686-3692, https://doi.org/10.1021/jf052944j . [all data]

Mahattanatawee, Rouseff, et al., 2005
Mahattanatawee, K.; Rouseff, R.; Filomena Valim, M.; Naim, M., Identification and aroma impact of norisoprenoids in orange juice, J. Agric. Food Chem., 2005, 53, 2, 393-397, https://doi.org/10.1021/jf049012k . [all data]

Bell, 2004
Bell, W.A.-M., Examination of Aroma Volatiles Formed from Thermal Processing of Florida Reconstituted Grapefruit Juice. A Thesis presented to the graduate school of the university of Florida in partial fulfillment of the requirements for the degree of master of science, 2004. [all data]

Karagül-Yüceer, Vlahovich, et al., 2003
Karagül-Yüceer, Y.; Vlahovich, K.N.; Drake, M.A.; Cadwallader, K.R., Characteristic aroma components of rennet casein, J. Agric. Food Chem., 2003, 51, 23, 6797-6801, https://doi.org/10.1021/jf0345806 . [all data]

Valim, Rouseff, et al., 2003
Valim, M.F.; Rouseff, R.L.; Lin, J., Gas chromatographic-olfactometric characterization of aroma compounds in two types of cashew apple nectar, J. Agric. Food Chem., 2003, 51, 4, 1010-1015, https://doi.org/10.1021/jf025738+ . [all data]

Karagül-Yüceer, Drake, et al., 2001
Karagül-Yüceer, Y.; Drake, M.; Cadwallader, K.R., Aroma-active components of nonfat dry milk, J. Agric. Food Chem., 2001, 49, 6, 2948-2953, https://doi.org/10.1021/jf0009854 . [all data]