3-Piperidinol, 1-ethyl-
- Formula: C7H15NO
- Molecular weight: 129.2001
- IUPAC Standard InChIKey: ZNPSUOAGONLMLK-UHFFFAOYSA-N
- CAS Registry Number: 13444-24-1
- Chemical structure:
View 3d structure (requires JavaScript / HTML 5) - Other names: N-Ethyl-3-hydroxypiperidine; N-Ethyl-3-piperidinol; 1-Ethyl-3-hydroxypiperidine; 1-Ethyl-3-piperidinol; 3-Hydroxy-1-ethylpiperidine; Ethyl-3-hydroxypiperidine; 1-ethylpiperidin-3-ol

Phase change data

Data compiled as indicated in comments:
BS - Robert L. Brown and Stephen E. Stein
AC - William E. Acree, Jr., James S. Chickos
Quantity | Value | Units | Method | Reference | Comment |
---|---|---|---|---|---|
ΔvapH° | 75.7 ± 0.4 | kJ/mol | C | Ribeiro da Silva and Cabral, 2006 | AC |
Reduced pressure boiling point
Tboil (K) | Pressure (bar) | Reference | Comment |
---|---|---|---|
367.2 | 0.020 | Weast and Grasselli, 1989 | BS |

References

Ribeiro da Silva and Cabral, 2006
Ribeiro da Silva, Manuel A.V.; Cabral, Joana I.T.A.,
Experimental Study on the Thermochemistry of Some Derivatives of Piperidinol,
J. Chem. Eng. Data, 2006, 51, 2, 767-771, https://doi.org/10.1021/je050508n
. [all data]
Weast and Grasselli, 1989
CRC Handbook of Data on Organic Compounds, 2nd Editon, Weast,R.C and Grasselli, J.G., ed(s)., CRC Press, Inc., Boca Raton, FL, 1989, 1. [all data]