2-Ethoxytetrahydrofuran
- Formula: C6H12O2
- Molecular weight: 116.1583
- IUPAC Standard InChIKey: JQYYUWHWGCJWTN-UHFFFAOYSA-N
- CAS Registry Number: 13436-46-9
- Chemical structure:
View 3d structure (requires JavaScript / HTML 5) - Other names: Furan, 2-ethoxytetrahydro-; 2-hydroxytetrahydrofuran

Kovats' RI, non-polar column, isothermal

Column type | Active phase | Temperature (C) | I | Reference | Comment |
---|---|---|---|---|---|
Packed | Silicon High Vacuum Grease (obsolete) | 170. | 790. | Jonas, Janák, et al., 1966 | H2 |
Packed | Silicon High Vacuum Grease (obsolete) | 170. | 790. | Janák, Jonas, et al., 1965 | H2, Celite |

Normal alkane RI, non-polar column, custom temperature program

Column type | Active phase | I | Reference | Comment |
---|---|---|---|---|
Capillary | HP-5 | 823. | Zhao, Li, et al., 2008 | 30. m/0.25 mm/0.25 μm; Program: 40 0C (2 min) 5 0C/min -> 80 0C 7 oC/min -> 160 0C 9 0C/min -> 200 0C 20 0C/min -> 280 0C (10 min) |
Capillary | HP-5 | 816. | Zhao, Li, et al., 2008 | 30. m/0.25 mm/0.25 μm; Program: not specified |

References

Jonas, Janák, et al., 1966
Jonas, J.; Janák, J.; Kratochvíl, M.,
Structural investigations with the aid of Kovats retention index system on one (nonpolar) stationary phase,
J. Gas Chromatogr., 1966, 4, 9, 332-335, https://doi.org/10.1093/chromsci/4.9.332
. [all data]
Janák, Jonas, et al., 1965
Janák, J.; Jonas, J.; Kratochvíl, M.,
Identification of some acetals of the tetrahydrofurane sereis by gas chromatography with the aid of the Kováts indices,
Collect. Czech. Chem. Commun., 1965, 30, 1, 265-276, https://doi.org/10.1135/cccc19650265
. [all data]
Zhao, Li, et al., 2008
Zhao, Y.; Li, J.; Xu, Y.; Duan, H.; Fan, W.; Zhao, G.,
EXtraction, preparation and identification of volatile compounds in Changyu XO brandy,
Chinese J. Chromatogr., 2008, 26, 2, 212-222, https://doi.org/10.1016/S1872-2059(08)60014-0
. [all data]