3-Hexanol, 2,4-dimethyl-
- Formula: C8H18O
- Molecular weight: 130.2279
- IUPAC Standard InChIKey: UCRQJBCLZKHOGX-UHFFFAOYSA-N
- CAS Registry Number: 13432-25-2
- Chemical structure:
View 3d structure (requires JavaScript / HTML 5) - Other names: 2,4-Dimethyl-3-hexanol; 2,4-dimethylhexan-3-ol

Phase change data

Data compiled as indicated in comments:
BS - Robert L. Brown and Stephen E. Stein
TRC - Thermodynamics Research Center, NIST Boulder Laboratories, Chris Muzny director
Quantity | Value | Units | Method | Reference | Comment |
---|---|---|---|---|---|
Tboil | 434.2 | K | N/A | Weast and Grasselli, 1989 | BS |
Tboil | 430.15 | K | N/A | Botteron and Shulman, 1962 | Uncertainty assigned by TRC = 3. K; TRC |
Tboil | 433. | K | N/A | Whitmore, Whitmore, et al., 1950 | Uncertainty assigned by TRC = 3. K; TRC |
Tboil | 433. | K | N/A | Whitmore, Whitmore, et al., 1950 | Uncertainty assigned by TRC = 3. K; TRC |
Tboil | 433.65 | K | N/A | Vaughan, 1944 | Uncertainty assigned by TRC = 3. K; calculated from data at other pressures; TRC |

References

Weast and Grasselli, 1989
CRC Handbook of Data on Organic Compounds, 2nd Editon, Weast,R.C and Grasselli, J.G., ed(s)., CRC Press, Inc., Boca Raton, FL, 1989, 1. [all data]
Botteron and Shulman, 1962
Botteron; Shulman,
J. Org. Chem., 1962, 27, 785. [all data]
Whitmore, Whitmore, et al., 1950
Whitmore, F.C.; Whitmore, H.E.; Cook, N.C.,
Hydrocarbons: X. Three New Octenes,
J. Am. Chem. Soc., 1950, 72, 51. [all data]
Vaughan, 1944
Vaughan,
, Ph.D. Thesis, Penn. State Univ., Univ. Park, PA, 1944. [all data]