2-Hexenoic acid, (E)-
- Formula: C6H10O2
- Molecular weight: 114.1424
- IUPAC Standard InChIKey: NIONDZDPPYHYKY-SNAWJCMRSA-N
- CAS Registry Number: 13419-69-7
- Chemical structure:
View 3d structure (requires JavaScript / HTML 5) - Species with the same structure:
- Other names: (E)-2-Hexenoic acid; trans-2-Hexenoic acid; 2-Hexenoic acid, trans-; (2E)-2-Hexenoic acid; (2E)-Hexenoic acid; trans-hex-2-enoic acid

Phase change data

Data compiled as indicated in comments:
BS - Robert L. Brown and Stephen E. Stein
TRC - Thermodynamics Research Center, NIST Boulder Laboratories, Chris Muzny director
Quantity | Value | Units | Method | Reference | Comment |
---|---|---|---|---|---|
Tboil | 490.2 | K | N/A | Aldrich Chemical Company Inc., 1990 | BS |
Quantity | Value | Units | Method | Reference | Comment |
Tfus | 307.65 | K | N/A | Walbaum and Rosenthal, 1930 | Uncertainty assigned by TRC = 1. K; TRC |

References

Aldrich Chemical Company Inc., 1990
Aldrich Chemical Company Inc.,
Catalog Handbook of Fine Chemicals, Aldrich Chemical Company, Inc., Milwaukee WI, 1990, 1. [all data]
Walbaum and Rosenthal, 1930
Walbaum, H.; Rosenthal, A.,
Japanese Peppermint Oil,
J. Prakt. Chem., 1930, 124, 63. [all data]